{"text_format":"1","workbook":"xlsx","n_sheets":6,"sheets":["GE","1CA","Saisie 1V","Résultats 1V","Synthèse 1V","M14-CONSEIL1"],"not_rendered":{"charts":0,"images":1,"macros":1,"external_links":0,"defined_names":38,"comments":0,"pivot_tables":0},"unopened":[],"bounds":{"document_bytes":16777216,"sheet_cells":100000,"rows_first":2000,"rows_last":500,"rows_between":2000,"halvings":0,"cell_chars":16384,"cell_head_chars":4096},"cells_cut":0,"cells_raw":0,"read":"whole","date_system":"1900"}

{"sheet":"GE","index":0,"n_rows":182,"n_cols":11,"rows_kept":182,"cut":false,"hidden":false,"merged":[[6,4,6,5]]}
[{"$f":"'1CA'!$A$1","v":"VILLE DE CRETEIL\n\nELECTIONS EUROPEENNES\n26 MAI 2019"}]
[]
[]
[]
[]
[]
[null,{"$f":"NOW()","v":"2019-05-26T23:05:47.390"},null,null,"SAISIR LES INSCRITS PAR BUREAU"]
[]
[]
["n°","bureaux","canton - circonscription","Total inscrits","inscrits","ressortissants européens"]
["N°","BUR","CAN","VAR"]
[1,"Hôtel de ville, salle 1","7-2",{"$f":"E12","v":921},921]
[]
[2,"Hôtel de ville, salle 2","7-2",{"$f":"E14","v":899},899]
[]
[3,"Mendès-France, maternelle","7-2",{"$f":"E16","v":884},884]
[]
[4,"Defferre, maternelle","7-2",{"$f":"E18","v":958},958]
[]
[5,"Port, Maison de quartier","7-2",{"$f":"E20","v":1070},1070]
[]
[6,"La Source, élémentaire","7-2",{"$f":"E22","v":965},965]
[]
[7,"Césaire, élementaire","7-2",{"$f":"E24","v":1310},1310]
[]
[8,"Gerbault","7-2",{"$f":"E26","v":1101},1101]
[]
[9,"Chateaubriand, maternelle","7-2",{"$f":"E28","v":1106},1106]
[]
[10,"Allezard, maternelle","7-1",{"$f":"E30","v":1090},1090]
[]
[11,"Allezard, élémentaire","7-1",{"$f":"E32","v":808},808]
[]
[12,"Hérédia, élementaire","7-2",{"$f":"E34","v":920},920]
[]
[13,"Péguy, élémentaire","7-2",{"$f":"E36","v":962},962]
[]
[14,"Pascal, élémentaire","7-2",{"$f":"E38","v":977},977]
[]
[15,"Monge, élémentaire","7-2",{"$f":"E40","v":851},851]
[null,null,null,null,null,null,null,"CRETEIL critères par canton"]
[16,"Monge, maternelle","7-2",{"$f":"E42","v":1002},1002,null,null,"CR",null,"CR_7","CR_8"]
[null,null,null,null,null,null,null,"CAN",null,"CAN","CAN"]
[17,"Lagrange, élémentaire","7-2",{"$f":"E44","v":992},992,null,null,"7*",null,"7*","8*"]
[null,null,null,null,null,null,null,"8*"]
[18,"Conservatoire de musique M.Dadi","7-1",{"$f":"E46","v":1035},1035]
[]
[19,"Eboué, élémentaire","7-2",{"$f":"E48","v":842},842,null,null,"CRETEIL critères par circonscription"]
[null,null,null,null,null,null,null,"CR-VM1",null,"CR_VM2"]
[20,"Eboué, maternelle","7-2",{"$f":"E50","v":735},735,null,null,"CAN",null,"CAN"]
[null,null,null,null,null,null,null,"7-1",null,"7-2"]
[21,"Le Cléac'h, maternelle","7-2",{"$f":"E52","v":972},972,null,null,"8-1",null,"8-2"]
[]
[22,"Beuvin, maternelle","7-2",{"$f":"E54","v":852},852]
[null,null,null,null,null,null,null,"VAL DE MARNE critères par circonscription"]
[23,"Halage, RPA","8-1",{"$f":"E56","v":1009},1009,null,null,"VM1",null,"VM2"]
[null,null,null,null,null,null,null,"CAN",null,"CAN"]
[24,"Beuvin, élémentaire","8-2",{"$f":"E58","v":685},685,null,null,"7-1",null,"7-2"]
[null,null,null,null,null,null,null,"8-1",null,"8-2"]
[25,"LCR, rue de Bonne","8-1",{"$f":"E60","v":1021},1021,null,null,"cp",null,"ch"]
[null,null,null,null,null,null,null,"sm-c",null,"or"]
[26,"Les Buttes, gymnase","8-1",{"$f":"E62","v":1090},1090,null,null,"sm-o"]
[null,null,null,null,null,null,null,"sm-v"]
[27,"Plaisance, collège","8-1",{"$f":"E64","v":969},969]
[]
[28,"Hugo, maternelle","8-1",{"$f":"E66","v":879},879]
[]
[29,"Maison du combattant","8-1",{"$f":"E68","v":989},989]
[]
[30,"Hugo, gymnase","8-1",{"$f":"E70","v":989},989]
[]
[31,"Salle polyvalente René Renaud","8-1",{"$f":"E72","v":1153},1153]
[]
[32,"Hugo, élémentaire","8-1",{"$f":"E74","v":978},978]
[]
[33,"Camus, maternelle","8-1",{"$f":"E76","v":1162},1162]
[]
[34,"Guiblets","8-2",{"$f":"E78","v":1019},1019]
[]
[35,"Casalis, élémentaire","8-2",{"$f":"E80","v":637},637]
[]
[36,"Guiblets","8-2",{"$f":"E82","v":748},748]
[]
[37,"Casalis, maternelle","8-2",{"$f":"E84","v":1023},1023]
[]
[38,"Jeu de paume","8-2",{"$f":"E86","v":807},807]
[]
[39,"Jeu de paume","8-2",{"$f":"E88","v":1178},1178]
[]
[40,"Savignat, maternelle ","8-2",{"$f":"E90","v":929},929]
[]
[41,"Savignat, élémentaire","8-2",{"$f":"E92","v":865},865]
[]
[42,"La Habette, élémentaire","8-2",{"$f":"E94","v":984},984]
[]
[43,"La Habette, élémentaire","8-2",{"$f":"E96","v":1103},1103]
[]
[44,"Centre socio-culturel M.Rebérioux","8-2",{"$f":"E98","v":926},926]
[]
[45,"Les Sarrazins, élémentaire","8-2",{"$f":"E100","v":1369},1369]
[]
[46,null,null,{"$f":"E102","v":0}]
[]
[47,null,null,{"$f":"E104","v":0}]
[]
[48,null,null,{"$f":"E106","v":0}]
[]
[49,null,null,{"$f":"E108","v":0}]
[]
[50,null,null,{"$f":"E110","v":0}]
[]
[]
[]
[]
[]
[]
[]
[]
[]
[]
[]
[]
[]
[]
[]
[]
[]
[]
[]
[]
[]
[]
[]
[]
[null,"Canton de Bonneuil","bo"]
[]
[null,"Canton de Champigny ouest","ch-o"]
[]
[null,"Canton de Saint-Maur centre","sm-c"]
[]
[null,"Canton de Saint-Maur ouest","sm-o"]
[]
[null,"Canton de Saint-Maur-La Varenne","sm-v"]
[]
[null,"y"]
[]
[null,"z"]
[]
[null,"Canton de Choisy-le-roi","clr"]
[]
[null,"Canton d'Orly","or"]
[]
[null,"a"]
[]
[null,"b"]
[]
[null,"c"]
[]
[null,"d"]
[]
[null,"e"]
[]
[]
[]
[]
[null,"COMMUNE DE CRETEIL",null,{"$f":"DSUM(BASE_G,4,CR)","v":43764},{"$f":"DSUM($A$11:$F$162,5,CR)","v":43764},{"$f":"DSUM($A$11:$F$162,6,CR)","v":0}]
[]
[]
[]
[null,"Canton n° 7",null,{"$f":"DSUM(BASE_G,4,CR_7)","v":21252},{"$f":"DSUM($A$11:$F$162,5,CR_7)","v":21252},{"$f":"DSUM($A$11:$F$162,6,CR_7)","v":0}]
[]
[null,"Canton n° 8",null,{"$f":"DSUM(BASE_G,4,CR_8)","v":22512},{"$f":"DSUM($A$11:$F$162,5,CR_8)","v":22512},{"$f":"DSUM($A$11:$F$162,6,CR_8)","v":0}]
[]
[]
[null,"1ère circonscription de Créteil",null,{"$f":"DSUM(BASE_G,4,CR_VM1)","v":13172}]
[]
[null,"2ème circonscription de Créteil",null,{"$f":"DSUM(BASE_G,4,CR_VM2)","v":30592}]
[]
[]
[null,"1ère circonscription du Val de Marne",null,{"$f":"DSUM(BASE_G,4,_VM1)","v":13172}]
[]
[null,"2ème circonscription du Val de Marne",null,{"$f":"DSUM(BASE_G,4,_VM2)","v":30592}]

{"sheet":"1CA","index":1,"n_rows":8,"n_cols":35,"rows_kept":8,"cut":false,"hidden":true,"merged":[[0,3,0,4]]}
["VILLE DE CRETEIL\n\nELECTIONS EUROPEENNES\n26 MAI 2019",null,null,{"$f":"NOW()","v":"2019-05-26T23:05:47.390"}]
[]
[]
["code du candidat","CAN01","CAN02","CAN03","CAN04","CAN05","CAN06","CAN07","CAN08","CAN09","CAN10","CAN11","CAN12","CAN13","CAN14","CAN15","CAN16","CAN17","CAN18","CAN19","CAN20","CAN21","CAN22","CAN23","CAN24","CAN25","CAN26","CAN27","CAN28","CAN29","CAN30","CAN31","CAN32","CAN33","CAN34"]
["Numéro du candidat",1,2,3,4,5,6,7,8,9,10,11,12,13,14,15,16,17,18,19,20,21,22,23,24,25,26,27,28,29,30,31,32,33,34]
["Nom du candidat ou de la liste","FRANCE INSOUMISE conduite par\nM. AUBRY","FRANCE ROYALE conduite par \nR. de PREVOISIN","LIGNE CLAIRE conduite par\nR. CAMUS","PARTI PIRATE conduite par \nF. MARIE","RÉPUBLIQUE EN MARCHE conduite par \nN. LOISEAU","DÉMOCRATIE RÉPRESENTATIVE conduite par \nH. TRAORE","PATRIOTES ET GILETS JAUNES conduite par \nF. PHILIPPOT","PACE conduite par \nA. ALEXANDRE","URGENCE ÉCOLOGIE conduite par \nD. BOURG","LISTE DE LA RECONQUÊTE conduite par \nV. VAUCLIN","LES EUROPÉENS conduite par \nJ-C. LAGARDE","ENVIE D’EUROPE conduite par \nR. GLUCKSMANN","PARTI FÉDÉRALISTE EUROPÉEN conduite par \nY. GERNIGON","MOUVEMENT POUR L’INITIATIVE CITOYENNE conduite par \nG. HELGEN","LE COURAGE DE DÉFENDRE LES FRANÇAIS conduite par \nN. DUPONT-AIGNAN","ALLONS ENFANTS conduite par \nS. CAILLAUD","DÉCROISSANCE 2019 conduite par \nT. DELFEL","LUTTE OUVRIERE conduite par \nN. ARTHAUD","POUR L’EUROPE DES GENS conduite par \nI. BROSSAT","ENSEMBLE POUR LE FREXIT conduite par \nF. ASSELINEAU","LISTE CITOYENNE DU PRINTEMPS EUROPEEN conduite par \nB. HAMON","À VOIX ÉGALES conduite par \nN. TOMASINI","PRENEZ LE POUVOIR conduite par \nJ. BARDELLA","NEUTRE ET ACTIF conduite par \nC. CORBET","PARTI RÉVOLUTIONNAIRE COMMUNISTES conduite par \nA. SANCHEZ","ESPÉRANTO conduite par \nP. DIEUMEGARD","ÉVOLUTION CITOYENNE conduite par \nC. CHALANCON","ALLIANCE JAUNE conduite par \nF. LALANNE","UNION DE LA DROITE ET DU CENTRE conduite par \nF. X. BELLAMY","EUROPE ÉCOLOGIE conduite par \nY. JADOT","PARTI ANIMALISTE conduite par \nH. THOUY","LES OUBLIÉS DE L’EUROPE conduite par \nO. BIDOU","UNION DÉMOCRATIQUE conduite par \nC. Luc PERSON","UNE EUROPE AU SERVICE DES PEUPLES conduite par \nN. AZERGUI"]
["Nom abrégé du parti ou de l'alliance (PS, PCF. . .)"]
["code de la famille politique (G, XG, . . .)"]

{"sheet":"Saisie 1V","index":2,"n_rows":76,"n_cols":45,"rows_kept":76,"cut":false,"hidden":false,"merged":[[0,0,0,2],[1,0,1,2],[4,43,4,44],[2,0,2,2],[2,3,2,5],[2,6,2,8],[2,9,2,11]]}
[{"$f":"'1CA'!A1","v":"VILLE DE CRETEIL\n\nELECTIONS EUROPEENNES\n26 MAI 2019"}]
[{"$f":"'1CA'!A2","v":0}]
["Tableau de saisie"]
[null,{"$f":"NOW()","v":"2019-05-26T23:05:47.390"}]
[{"$f":"GE!A10:C10","v":"n°"},"bureaux","canton - circonscription","inscrits","émarge-\nments","bulletins","blancs","nuls",{"$f":"'1CA'!B6:AF6","v":"FRANCE INSOUMISE conduite par\nM. AUBRY"},"FRANCE ROYALE conduite par \nR. de PREVOISIN","LIGNE CLAIRE conduite par\nR. CAMUS","PARTI PIRATE conduite par \nF. MARIE","RÉPUBLIQUE EN MARCHE conduite par \nN. LOISEAU","DÉMOCRATIE RÉPRESENTATIVE conduite par \nH. TRAORE","PATRIOTES ET GILETS JAUNES conduite par \nF. PHILIPPOT","PACE conduite par \nA. ALEXANDRE","URGENCE ÉCOLOGIE conduite par \nD. BOURG","LISTE DE LA RECONQUÊTE conduite par \nV. VAUCLIN","LES EUROPÉENS conduite par \nJ-C. LAGARDE","ENVIE D’EUROPE conduite par \nR. GLUCKSMANN","PARTI FÉDÉRALISTE EUROPÉEN conduite par \nY. GERNIGON","MOUVEMENT POUR L’INITIATIVE CITOYENNE conduite par \nG. HELGEN","LE COURAGE DE DÉFENDRE LES FRANÇAIS conduite par \nN. DUPONT-AIGNAN","ALLONS ENFANTS conduite par \nS. CAILLAUD","DÉCROISSANCE 2019 conduite par \nT. DELFEL","LUTTE OUVRIERE conduite par \nN. ARTHAUD","POUR L’EUROPE DES GENS conduite par \nI. BROSSAT","ENSEMBLE POUR LE FREXIT conduite par \nF. ASSELINEAU","LISTE CITOYENNE DU PRINTEMPS EUROPEEN conduite par \nB. HAMON","À VOIX ÉGALES conduite par \nN. TOMASINI","PRENEZ LE POUVOIR conduite par \nJ. BARDELLA","NEUTRE ET ACTIF conduite par \nC. CORBET","PARTI RÉVOLUTIONNAIRE COMMUNISTES conduite par \nA. SANCHEZ","ESPÉRANTO conduite par \nP. DIEUMEGARD","ÉVOLUTION CITOYENNE conduite par \nC. CHALANCON","ALLIANCE JAUNE conduite par \nF. LALANNE","UNION DE LA DROITE ET DU CENTRE conduite par \nF. X. BELLAMY","EUROPE ÉCOLOGIE conduite par \nY. JADOT","PARTI ANIMALISTE conduite par \nH. THOUY",{"$f":"'1CA'!AG6:BK6","v":"LES OUBLIÉS DE L’EUROPE conduite par \nO. BIDOU"},{"$f":"'1CA'!AH6:BL6","v":"UNION DÉMOCRATIQUE conduite par \nC. Luc PERSON"},{"$f":"'1CA'!AI6:BM6","v":"UNE EUROPE AU SERVICE DES PEUPLES conduite par \nN. AZERGUI"},"Liste arrivée en tête","CONTROLE"]
["N°","BUR","CAN","INS","EMA","BUL",null,"BLA","can1","can2","can3","can4","can5","can6","can7","can8","can9","can10","can11","can12","can13","can14","can15","can16","can17","can18","can19","can20","can21","can22","can23","can24","can25","can26","can27","can28","can29","can30"]
[{"$f":"GE!$A$12:$D$12","v":1},"Hôtel de ville, salle 1","7-2",921,null,405,4,4,23,0,0,1,119,0,0,0,7,0,11,45,0,0,4,0,0,5,11,19,19,2,36,0,0,0,0,0,46,43,1,1,0,4,{"$f":"IF(SUM(I7:U7)=0,\"résultats en attente\",IF(COUNTIF(I7:U7,MAX(I7:U7))>1,\"ex aequo\",INDEX($I$5:$U$5,MATCH(MAX(I7:U7),I7:U7,0))))","v":"RÉPUBLIQUE EN MARCHE conduite par \nN. LOISEAU"},{"$f":"SUM($I7:$AP7)","v":397},{"$f":"IF($AR7=($F7-($G7+$H7)),\"\",\"erreur\")","v":""}]
[{"$f":"GE!$A$14:$D$14","v":2},"Hôtel de ville, salle 2","7-2",899,null,432,1,1,21,1,0,4,149,0,0,0,10,0,12,25,1,0,7,0,0,4,9,4,12,0,45,0,0,0,0,1,51,56,12,1,0,5,{"$f":"IF(SUM(I8:U8)=0,\"résultats en attente\",IF(COUNTIF(I8:U8,MAX(I8:U8))>1,\"ex aequo\",INDEX($I$5:$U$5,MATCH(MAX(I8:U8),I8:U8,0))))","v":"RÉPUBLIQUE EN MARCHE conduite par \nN. LOISEAU"},{"$f":"SUM($I8:$AP8)","v":430},{"$f":"IF($AR8=($F8-($G8+$H8)),\"\",\"erreur\")","v":""}]
[{"$f":"GE!$A$16:$D$16","v":3},"Mendès-France, maternelle","7-2",884,null,396,10,14,48,0,0,5,67,0,1,0,15,0,5,41,0,0,5,1,3,5,8,7,17,0,39,0,0,1,0,3,37,39,12,2,2,9,"RÉPUBLIQUE EN MARCHE conduite par \nN. LOISEAU",372,""]
[{"$f":"GE!$A$18:$D$18","v":4},"Defferre, maternelle","7-2",958,null,394,6,10,59,0,0,23,59,0,1,0,5,0,6,33,0,0,18,0,0,5,9,2,23,0,45,0,0,0,0,3,26,41,6,0,0,14,"ex aequo",378,""]
[{"$f":"GE!$A$20:$D$20","v":5},"Port, Maison de quartier","7-2",1070,null,429,11,5,37,0,0,2,94,0,1,0,10,0,5,35,1,0,12,0,0,3,11,13,18,1,48,0,0,0,0,0,36,55,11,2,3,15,"RÉPUBLIQUE EN MARCHE conduite par \nN. LOISEAU",413,""]
[{"$f":"GE!$A$22:$D$22","v":6},"La Source, élémentaire","7-2",965,null,404,12,6,49,0,3,0,79,0,1,0,10,0,12,35,0,0,13,0,0,2,11,11,13,0,55,0,0,0,0,2,22,45,11,2,0,10,"RÉPUBLIQUE EN MARCHE conduite par \nN. LOISEAU",386,""]
[{"$f":"GE!$A$24:$D$24","v":7},"Césaire, élementaire","7-2",1310,null,604,16,5,64,0,0,1,161,0,1,1,7,0,10,41,1,0,24,0,0,4,21,12,42,0,56,0,0,1,0,0,38,69,5,3,0,21,"RÉPUBLIQUE EN MARCHE conduite par \nN. LOISEAU",583,""]
[{"$f":"GE!$A$26:$D$26","v":8},"Gerbault","7-2",1101,null,512,10,5,28,0,0,3,145,0,0,0,10,0,17,38,0,0,15,0,0,4,24,14,24,0,58,0,0,0,0,1,51,51,8,0,1,5,"RÉPUBLIQUE EN MARCHE conduite par \nN. LOISEAU",497,""]
[{"$f":"GE!$A$28:$D$28","v":9},"Chateaubriand, maternelle","7-2",1106,null,510,15,14,49,0,0,2,97,0,4,0,11,0,10,39,1,0,20,0,0,3,15,11,37,0,75,0,0,2,0,5,20,60,8,1,0,11,"RÉPUBLIQUE EN MARCHE conduite par \nN. LOISEAU",481,""]
[{"$f":"GE!$A$30:$D$30","v":10},"Allezard, maternelle","7-1",1090,null,481,9,7,51,0,0,1,108,0,0,0,13,0,15,28,0,0,14,0,1,3,7,12,26,0,86,0,0,0,0,8,23,61,8,0,0,0,"RÉPUBLIQUE EN MARCHE conduite par \nN. LOISEAU",465,""]
[{"$f":"GE!$A$32:$D$32","v":11},"Allezard, élémentaire","7-1",808,null,386,9,7,16,0,0,2,88,0,1,0,7,0,14,32,1,0,14,0,0,1,20,7,10,0,63,0,0,0,0,1,24,58,6,0,0,5,"RÉPUBLIQUE EN MARCHE conduite par \nN. LOISEAU",370,""]
[{"$f":"GE!$A$34:$D$34","v":12},"Hérédia, élementaire","7-2",920,null,430,9,8,40,0,0,4,89,0,3,0,6,1,13,50,1,0,11,0,0,2,15,7,18,0,52,0,0,0,0,0,33,58,4,0,0,6,"RÉPUBLIQUE EN MARCHE conduite par \nN. LOISEAU",413,""]
[{"$f":"GE!$A$36:$D$36","v":13},"Péguy, élémentaire","7-2",962,null,390,3,3,41,0,0,1,100,0,2,0,6,0,15,27,0,0,15,0,0,3,11,5,20,0,49,0,0,0,0,2,21,44,6,1,0,15,"RÉPUBLIQUE EN MARCHE conduite par \nN. LOISEAU",384,""]
[{"$f":"GE!$A$38:$D$38","v":14},"Pascal, élémentaire","7-2",977,null,370,12,12,28,0,0,0,75,0,1,0,3,0,5,22,0,0,20,0,0,5,11,9,12,0,68,0,0,0,0,2,20,37,8,0,5,15,"RÉPUBLIQUE EN MARCHE conduite par \nN. LOISEAU",346,""]
[{"$f":"GE!$A$40:$D$40","v":15},"Monge, élémentaire","7-2",851,null,418,12,5,36,0,0,1,85,0,0,0,8,0,6,34,0,0,10,0,0,5,20,7,17,0,56,0,0,0,0,7,15,60,22,0,2,10,"RÉPUBLIQUE EN MARCHE conduite par \nN. LOISEAU",401,""]
[{"$f":"GE!$A$42:$D$42","v":16},"Monge, maternelle","7-2",1002,null,447,8,7,42,0,0,1,98,0,0,0,6,0,13,26,1,0,17,0,0,2,23,11,28,0,65,0,0,1,0,2,34,45,5,0,0,12,"RÉPUBLIQUE EN MARCHE conduite par \nN. LOISEAU",432,""]
[{"$f":"GE!$A$44:$D$44","v":17},"Lagrange, élémentaire","7-2",992,null,476,9,5,45,0,0,0,115,0,2,1,18,0,15,46,0,0,9,0,0,1,14,14,25,0,60,0,0,0,0,1,24,60,7,0,0,5,"RÉPUBLIQUE EN MARCHE conduite par \nN. LOISEAU",462,""]
[{"$f":"GE!$A$46:$D$46","v":18},"Conservatoire de musique M.Dadi","7-1",1035,null,493,12,5,48,0,0,1,132,0,1,0,13,0,11,30,1,0,8,0,0,2,23,4,10,4,57,0,0,0,0,0,28,89,10,1,1,2,"RÉPUBLIQUE EN MARCHE conduite par \nN. LOISEAU",476,""]
[{"$f":"GE!$A$48:$D$48","v":19},"Eboué, élémentaire","7-2",842,null,371,6,8,35,0,0,2,82,0,2,0,7,0,6,25,1,0,7,0,0,6,8,3,12,0,47,0,0,0,0,2,32,70,4,0,1,5,"RÉPUBLIQUE EN MARCHE conduite par \nN. LOISEAU",357,""]
[{"$f":"GE!A50:D50","v":20},"Eboué, maternelle","7-2",735,null,312,6,7,56,0,0,0,91,0,1,0,7,0,5,14,0,0,8,0,0,3,6,7,20,0,27,0,0,0,0,3,18,23,4,0,1,5,"RÉPUBLIQUE EN MARCHE conduite par \nN. LOISEAU",299,""]
[{"$f":"GE!A52:D52","v":21},"Le Cléac'h, maternelle","7-2",972,null,424,8,6,38,0,0,2,90,0,0,0,8,1,6,35,1,0,8,0,0,1,11,10,24,0,51,0,0,0,0,1,18,79,7,1,0,18,"RÉPUBLIQUE EN MARCHE conduite par \nN. LOISEAU",410,""]
[{"$f":"GE!A54:D54","v":22},"Beuvin, maternelle","7-2",852,null,390,4,6,34,0,0,2,79,0,0,0,6,0,11,18,1,0,13,0,0,1,11,5,16,0,75,0,0,0,0,2,34,58,11,1,1,1,{"$f":"IF(SUM(I28:U28)=0,\"résultats en attente\",IF(COUNTIF(I28:U28,MAX(I28:U28))>1,\"ex aequo\",INDEX($I$5:$U$5,MATCH(MAX(I28:U28),I28:U28,0))))","v":"RÉPUBLIQUE EN MARCHE conduite par \nN. LOISEAU"},380,{"$f":"IF($AR28=($F28-($G28+$H28)),\"\",\"erreur\")","v":""}]
[{"$f":"GE!A56:D56","v":23},"Halage, RPA","8-1",1009,null,616,6,9,18,0,0,0,192,0,1,0,9,0,16,60,0,0,19,0,0,1,9,5,26,0,65,0,0,2,0,2,52,110,13,0,1,0,"RÉPUBLIQUE EN MARCHE conduite par \nN. LOISEAU",601,""]
[{"$f":"GE!A58:D58","v":24},"Beuvin, élémentaire","8-2",685,null,278,5,4,42,0,0,0,71,0,0,0,4,0,7,18,1,0,11,0,0,3,7,6,5,0,28,0,0,0,0,5,14,43,1,0,0,3,"RÉPUBLIQUE EN MARCHE conduite par \nN. LOISEAU",269,""]
[{"$f":"GE!A60:D60","v":25},"LCR, rue de Bonne","8-1",1021,null,697,11,9,30,0,0,4,233,0,1,0,11,0,19,71,0,0,17,0,1,2,24,7,15,0,58,0,0,0,0,1,42,121,13,2,1,4,"RÉPUBLIQUE EN MARCHE conduite par \nN. LOISEAU",677,""]
[{"$f":"GE!A62:D62","v":26},"Les Buttes, gymnase","8-1",1090,null,614,10,7,29,0,0,5,170,0,1,0,13,0,20,61,0,0,24,0,0,4,9,7,24,0,57,0,0,1,0,1,54,101,9,0,1,6,"RÉPUBLIQUE EN MARCHE conduite par \nN. LOISEAU",597,""]
[{"$f":"GE!A64:D64","v":27},"Plaisance, collège","8-1",969,null,508,8,8,29,0,0,0,118,0,2,2,14,0,11,48,0,0,18,0,1,3,12,6,25,0,53,0,0,0,0,1,43,87,16,1,0,2,"RÉPUBLIQUE EN MARCHE conduite par \nN. LOISEAU",492,{"$f":"IF($AR33=($F33-($G33+$H33)),\"\",\"erreur\")","v":""}]
[{"$f":"GE!A66:D66","v":28},"Hugo, maternelle","8-1",879,null,557,2,3,16,0,0,3,161,0,2,0,8,0,9,37,0,0,24,0,0,0,7,5,32,0,88,0,0,0,0,0,53,98,9,0,0,0,"RÉPUBLIQUE EN MARCHE conduite par \nN. LOISEAU",552,""]
[{"$f":"GE!A68:D68","v":29},"Maison du combattant","8-1",989,null,524,18,10,41,0,0,2,95,0,5,0,18,0,12,32,0,0,10,0,0,4,13,16,26,0,73,0,0,0,0,1,29,87,16,2,0,14,"RÉPUBLIQUE EN MARCHE conduite par \nN. LOISEAU",496,""]
[{"$f":"GE!A70:D70","v":30},"Hugo, gymnase","8-1",989,null,553,13,8,26,0,0,1,152,0,2,0,10,0,4,41,0,0,17,0,0,2,22,12,20,0,72,0,0,2,0,2,52,77,11,1,0,6,"RÉPUBLIQUE EN MARCHE conduite par \nN. LOISEAU",532,""]
[{"$f":"GE!A72:D72","v":31},"Salle polyvalente René Renaud","8-1",1153,null,602,12,4,34,0,0,1,154,0,1,0,9,0,13,58,1,0,21,0,0,3,22,6,20,0,99,0,0,0,0,0,41,84,16,0,0,3,"RÉPUBLIQUE EN MARCHE conduite par \nN. LOISEAU",586,""]
[{"$f":"GE!A74:D74","v":32},"Hugo, élémentaire","8-1",978,null,570,5,5,22,0,0,1,165,0,0,0,8,0,11,44,4,0,16,1,0,0,15,5,22,0,49,0,0,0,0,2,47,132,8,1,0,7,"RÉPUBLIQUE EN MARCHE conduite par \nN. LOISEAU",560,""]
[{"$f":"GE!A76:D76","v":33},"Camus, maternelle","8-1",1162,null,579,14,8,42,0,0,2,150,0,2,0,9,0,11,42,0,0,20,0,0,1,13,7,19,0,74,0,0,0,0,0,50,92,16,2,0,5,"RÉPUBLIQUE EN MARCHE conduite par \nN. LOISEAU",557,""]
[{"$f":"GE!A78:D78","v":34},"Guiblets","8-2",1019,null,437,9,14,33,0,0,0,109,0,1,0,9,0,15,27,0,0,15,0,0,2,10,7,12,0,68,0,0,0,0,0,39,44,13,1,1,8,"RÉPUBLIQUE EN MARCHE conduite par \nN. LOISEAU",414,""]
[{"$f":"GE!A80:D80","v":35},"Casalis, élémentaire","8-2",637,null,210,5,3,36,0,0,0,34,0,1,0,5,0,2,15,1,0,5,0,0,0,9,5,13,0,32,0,0,0,0,2,12,20,6,0,0,4,"FRANCE INSOUMISE conduite par\nM. AUBRY",202,""]
[{"$f":"GE!A82:D82","v":36},"Guiblets","8-2",748,null,258,6,5,31,0,0,0,41,0,0,0,15,0,8,14,0,0,8,0,0,2,13,4,19,0,43,0,0,0,0,1,14,26,7,0,0,1,"RÉPUBLIQUE EN MARCHE conduite par \nN. LOISEAU",247,""]
[{"$f":"GE!A84:D84","v":37},"Casalis, maternelle","8-2",1023,null,309,5,7,55,0,0,1,42,0,0,0,5,0,2,21,0,0,2,0,0,4,9,7,24,0,53,0,0,0,0,0,11,32,6,3,2,18,"FRANCE INSOUMISE conduite par\nM. AUBRY",297,""]
[{"$f":"GE!A86:D86","v":38},"Jeu de paume","8-2",807,null,266,6,11,38,0,0,0,45,0,1,0,1,0,4,24,0,0,7,0,0,1,16,4,21,0,39,0,0,0,0,0,11,22,6,2,2,5,"RÉPUBLIQUE EN MARCHE conduite par \nN. LOISEAU",249,""]
[{"$f":"GE!A88:D88","v":39},"Jeu de paume","8-2",1178,null,466,7,10,63,0,0,1,74,0,1,0,7,0,2,41,0,0,21,0,0,3,7,4,13,0,86,0,0,1,0,0,22,54,23,0,0,26,"RÉPUBLIQUE EN MARCHE conduite par \nN. LOISEAU",449,""]
[{"$f":"GE!A90:D90","v":40},"Savignat, maternelle ","8-2",929,null,273,7,9,29,0,0,0,33,0,1,0,2,0,6,28,0,0,6,0,0,0,13,5,21,0,38,0,0,0,0,2,18,25,4,1,0,25,"RÉPUBLIQUE EN MARCHE conduite par \nN. LOISEAU",257,""]
[{"$f":"GE!A92:D92","v":41},"Savignat, élémentaire","8-2",865,null,358,10,9,40,0,0,1,51,0,3,0,6,0,8,28,1,0,13,0,0,0,16,6,14,0,69,0,0,0,0,0,9,44,10,1,0,19,"RÉPUBLIQUE EN MARCHE conduite par \nN. LOISEAU",339,""]
[{"$f":"GE!A94:D94","v":42},"La Habette, élémentaire","8-2",984,null,342,7,12,59,0,0,2,40,0,3,0,15,0,7,25,0,0,13,0,0,3,17,5,15,0,68,0,0,0,0,1,3,36,4,0,0,7,"FRANCE INSOUMISE conduite par\nM. AUBRY",323,""]
[{"$f":"GE!A96:D96","v":43},"La Habette, élémentaire","8-2",1103,null,373,7,6,45,0,0,1,52,0,3,0,10,0,4,45,0,0,8,0,0,7,20,9,27,0,57,0,0,0,0,2,12,34,12,0,1,11,"RÉPUBLIQUE EN MARCHE conduite par \nN. LOISEAU",360,""]
[{"$f":"GE!A98:D98","v":44},"Centre socio-culturel M.Rebérioux","8-2",926,null,369,13,5,41,0,0,4,57,0,2,0,7,0,3,39,0,0,4,0,0,3,11,12,17,0,46,0,0,1,0,2,15,51,9,0,2,25,"RÉPUBLIQUE EN MARCHE conduite par \nN. LOISEAU",351,""]
[{"$f":"GE!A100:D100","v":45},"Les Sarrazins, élémentaire","8-2",1369,null,544,16,7,64,0,0,1,116,0,3,0,11,0,11,46,1,0,5,0,0,5,21,10,45,0,62,0,0,0,0,2,12,79,8,2,2,15,"RÉPUBLIQUE EN MARCHE conduite par \nN. LOISEAU",521,""]
[{"$f":"GE!A102:D102","v":46},0,0,0,null,null,null,null,null,null,null,100,null,null,null,100,null,null,null,null,null,null,null,null,null,null,null,null,null,null,null,null,null,null,null,null,null,null,null,null,null,null,null,{"$f":"SUM($I52:$AM52)","v":200},"erreur"]
[{"$f":"GE!A104:D104","v":47},0,0,0,null,null,null,null,null,null,null,100,null,null,null,100,null,null,null,null,null,null,null,null,null,null,null,null,null,null,null,null,null,null,null,null,null,null,null,null,null,null,null,{"$f":"SUM($I53:$AM53)","v":200},"erreur"]
[{"$f":"GE!A106:D106","v":48},0,0,0,null,null,null,null,null,null,null,null,null,null,null,100,null,null,null,null,null,null,null,null,null,null,null,null,null,null,null,null,null,null,null,null,null,null,null,null,null,null,null,{"$f":"SUM($I54:$AM54)","v":100},"erreur"]
[{"$f":"GE!A108:D108","v":49},0,0,0,null,null,null,null,null,null,null,null,null,null,100,null,null,null,null,null,null,null,null,null,null,null,null,null,null,null,null,null,null,null,null,null,null,null,null,null,null,null,null,{"$f":"SUM($I55:$AM55)","v":100},"erreur"]
[{"$f":"GE!A110:D110","v":50},0,0,0,null,null,null,null,null,null,null,null,null,null,100,null,null,null,null,null,null,null,null,null,null,null,null,null,null,null,null,null,null,null,null,null,null,null,null,null,null,null,null,{"$f":"SUM($I56:$AM56)","v":100},"erreur"]
[null,null,null,null,null,null,null,null,null,null,null,null,null,null,100]
[null,null,null,null,null,null,null,null,null,null,null,null,null,null,100]
[{"$f":"GE!A135:D135","v":0},"Canton de Bonneuil","bo",0,null,null,null,null,null,null,null,null,null,null,100,null,null,null,null,null,null,null,null,null,null,null,null,null,null,null,null,null,null,null,null,null,null,null,null,null,null,null,null,{"$f":"SUM($I59:$AM59)","v":100},{"$f":"IF($AR59=($F59-($G59+$H59)),\"\",\"erreur\")","v":"erreur"}]
[{"$f":"GE!A137:D137","v":0},"Canton de Champigny ouest","ch-o",0,null,null,null,null,null,null,null,null,null,null,100,null,null,null,null,null,null,null,null,null,null,null,null,null,null,null,null,null,null,null,null,null,null,null,null,null,null,null,null,100,"erreur"]
[{"$f":"GE!A139:D139","v":0},"Canton de Saint-Maur centre","sm-c",0,null,null,null,null,null,null,null,null,null,null,100,null,null,null,null,null,null,null,null,null,null,null,null,null,null,null,null,null,null,null,null,null,null,null,null,null,null,null,null,100,"erreur"]
[{"$f":"GE!A141:D141","v":0},"Canton de Saint-Maur ouest","sm-o",0,null,null,null,null,null,null,null,null,null,null,100,null,null,null,null,null,null,null,null,null,null,null,null,null,null,null,null,null,null,null,null,null,null,null,null,null,null,null,null,100,"erreur"]
[{"$f":"GE!A143:D143","v":0},"Canton de Saint-Maur-La Varenne","sm-v",0,null,null,null,null,null,null,null,null,null,null,100,null,null,null,null,null,null,null,null,null,null,null,null,null,null,null,null,null,null,null,null,null,null,null,null,null,null,null,null,100,"erreur"]
[{"$f":"GE!A145:D145","v":0},"y",0,0,null,null,null,null,null,null,null,null,null,null,100,null,null,null,null,null,null,null,null,null,null,null,null,null,null,null,null,null,null,null,null,null,null,null,null,null,null,null,null,100,"erreur"]
[{"$f":"GE!A147:D147","v":0},"z",0,0,null,null,null,null,null,null,null,null,null,null,100,null,null,null,null,null,null,null,null,null,null,null,null,null,null,null,null,null,null,null,null,null,null,null,null,null,null,null,null,100,"erreur"]
[null,null,null,null,null,null,null,null,null,null,null,null,null,null,100]
[null,null,null,null,null,null,null,null,null,null,null,null,null,null,100]
[null,null,null,null,null,null,null,null,null,null,null,null,null,null,100]
[{"$f":"GE!A149:D149","v":0},"Canton de Choisy-le-roi","clr",0,null,null,null,null,null,null,null,null,null,null,100,null,null,null,null,null,null,null,null,null,null,null,null,null,null,null,null,null,null,null,null,null,null,null,null,null,null,null,null,{"$f":"SUM($I69:$AM69)","v":100},{"$f":"IF($AR69=($F69-($G69+$H69)),\"\",\"erreur\")","v":"erreur"}]
[{"$f":"GE!A151:D151","v":0},"Canton d'Orly","or",0,null,null,null,null,null,null,null,null,null,null,100,null,null,null,null,null,null,null,null,null,null,null,null,null,null,null,null,null,null,null,null,null,null,null,null,null,null,null,null,{"$f":"SUM($I70:$AM70)","v":100},"erreur"]
[{"$f":"GE!A153:D153","v":0},"a",0,0,null,null,null,null,null,null,null,null,null,null,100,null,null,null,null,null,null,null,null,null,null,null,null,null,null,null,null,null,null,null,null,null,null,null,null,null,null,null,null,100,"erreur"]
[{"$f":"GE!A155:D155","v":0},"b",0,0,null,null,null,null,null,null,null,null,null,null,100,null,null,null,null,null,null,null,null,null,null,null,null,null,null,null,null,null,null,null,null,null,null,null,null,null,null,null,null,100,"erreur"]
[{"$f":"GE!A157:D157","v":0},"c",0,0,null,null,null,null,null,null,null,null,null,null,100,null,null,null,null,null,null,null,null,null,null,null,null,null,null,null,null,null,null,null,null,null,null,null,null,null,null,null,null,100,"erreur"]
[{"$f":"GE!A159:D159","v":0},"d",0,0,null,null,null,null,null,null,null,null,null,null,100,null,null,null,null,null,null,null,null,null,null,null,null,null,null,null,null,null,null,null,null,null,null,null,null,null,null,null,null,100,"erreur"]
[{"$f":"GE!A161:D161","v":0},"e",0,0,null,null,null,null,null,null,null,null,null,null,100,null,null,null,null,null,null,null,null,null,null,null,null,null,null,null,null,null,null,null,null,null,null,null,null,null,null,null,null,100,"erreur"]
[null,null,null,null,null,null,null,null,null,null,null,null,null,null,100]

{"sheet":"Résultats 1V","index":3,"n_rows":173,"n_cols":51,"rows_kept":173,"cut":false,"hidden":false,"merged":[[2,0,2,15]]}
[]
[]
[{"$f":"'1CA'!A2","v":0}]
[null,{"$f":"NOW()","v":"2019-05-26T23:05:47.390"}]
[{"$f":"'Saisie 1V'!A5:F5","v":"n°"},"bureaux","canton - circonscription","inscrits","émarge-\nments","bulletins","abstentions","blancs","nuls","blancs et nuls","exprimés",{"$f":"'Saisie 1V'!I5:AQ5","v":"FRANCE INSOUMISE conduite par\nM. AUBRY"},"FRANCE ROYALE conduite par \nR. de PREVOISIN","LIGNE CLAIRE conduite par\nR. CAMUS","PARTI PIRATE conduite par \nF. MARIE","RÉPUBLIQUE EN MARCHE conduite par \nN. LOISEAU","DÉMOCRATIE RÉPRESENTATIVE conduite par \nH. TRAORE","PATRIOTES ET GILETS JAUNES conduite par \nF. PHILIPPOT","PACE conduite par \nA. ALEXANDRE","URGENCE ÉCOLOGIE conduite par \nD. BOURG","LISTE DE LA RECONQUÊTE conduite par \nV. VAUCLIN","LES EUROPÉENS conduite par \nJ-C. LAGARDE","ENVIE D’EUROPE conduite par \nR. GLUCKSMANN","PARTI FÉDÉRALISTE EUROPÉEN conduite par \nY. GERNIGON","MOUVEMENT POUR L’INITIATIVE CITOYENNE conduite par \nG. HELGEN","LE COURAGE DE DÉFENDRE LES FRANÇAIS conduite par \nN. DUPONT-AIGNAN","ALLONS ENFANTS conduite par \nS. CAILLAUD","DÉCROISSANCE 2019 conduite par \nT. DELFEL","LUTTE OUVRIERE conduite par \nN. ARTHAUD","POUR L’EUROPE DES GENS conduite par \nI. BROSSAT","ENSEMBLE POUR LE FREXIT conduite par \nF. ASSELINEAU","LISTE CITOYENNE DU PRINTEMPS EUROPEEN conduite par \nB. HAMON","À VOIX ÉGALES conduite par \nN. TOMASINI","PRENEZ LE POUVOIR conduite par \nJ. BARDELLA","NEUTRE ET ACTIF conduite par \nC. CORBET","PARTI RÉVOLUTIONNAIRE COMMUNISTES conduite par \nA. SANCHEZ","ESPÉRANTO conduite par \nP. DIEUMEGARD","ÉVOLUTION CITOYENNE conduite par \nC. CHALANCON","ALLIANCE JAUNE conduite par \nF. LALANNE","UNION DE LA DROITE ET DU CENTRE conduite par \nF. X. BELLAMY","EUROPE ÉCOLOGIE conduite par \nY. JADOT","PARTI ANIMALISTE conduite par \nH. THOUY",{"$f":"'Saisie 1V'!AN5:BV5","v":"LES OUBLIÉS DE L’EUROPE conduite par \nO. BIDOU"},{"$f":"'Saisie 1V'!AO5:BW5","v":"UNION DÉMOCRATIQUE conduite par \nC. Luc PERSON"},{"$f":"'Saisie 1V'!AP5:BX5","v":"UNE EUROPE AU SERVICE DES PEUPLES conduite par \nN. AZERGUI"}]
["N°","BUR","CAN","INS","EMA","BUL","ABS",null,null,"BLA","EXP","can1","can2","can3","can4","can5","can6","can7","can8","can9","can10","can11","can12","can13","can14","can15","can16","can17","can18","can19","can20","can21","can22","can23","can24","can25","can26","can27","can28","can29","can30","can31","can32","can33","can34"]
[{"$f":"GE!A12:D111","v":1},"Hôtel de ville, salle 1","7-2",921,{"$f":"'Saisie 1V'!E7:F7","v":0},405,{"$f":"D7-F7","v":516},{"$f":"'Saisie 1V'!G7","v":4},{"$f":"'Saisie 1V'!H7","v":4},{"$f":"H7+I7","v":8},{"$f":"F7-J7","v":397},{"$f":"'Saisie 1V'!I7:AM7","v":23},0,0,1,119,0,0,0,7,0,11,45,0,0,4,0,0,5,11,19,19,2,36,0,0,0,0,0,46,43,1,{"$f":"'Saisie 1V'!AN7:BR7","v":1},{"$f":"'Saisie 1V'!AO7:BS7","v":0},{"$f":"'Saisie 1V'!AP7:BT7","v":4}]
[0,0,0,0,{"$f":"E7/D7","v":0},{"$f":"IF(F7=0,\"\",F7/D7)","v":0.43973941368078173},{"$f":"IF(G7=0,\"\",G7/$D$7)","v":0.56026058631921827},{"$f":"IF(H7=0,\"\",H7/$F$7)","v":9.876543209876543E-3},{"$f":"IF(I7=0,\"\",I7/$F$7)","v":9.876543209876543E-3},{"$f":"IF(J7=0,\"\",J7/$F$7)","v":1.9753086419753086E-2},null,{"$f":"L7/K7","v":5.793450881612091E-2},{"$f":"M7/K7","v":0},{"$f":"N7/K7","v":0},{"$f":"O7/K7","v":2.5188916876574307E-3},{"$f":"P7/K7","v":0.29974811083123426},{"$f":"Q7/K7","v":0},{"$f":"R7/K7","v":0},{"$f":"S7/$K$7","v":0},1.7632241813602016E-2,0,2.7707808564231738E-2,0.11335012594458438,0,0,1.0075566750629723E-2,0,0,1.2594458438287154E-2,2.7707808564231738E-2,4.7858942065491183E-2,4.7858942065491183E-2,5.0377833753148613E-3,9.06801007556675E-2,0,0,{"$f":"AK7/$K$7","v":0},0,0,0.11586901763224182,0.10831234256926953,2.5188916876574307E-3,{"$f":"AQ7/$K$7","v":2.5188916876574307E-3},0,1.0075566750629723E-2]
[2,"Hôtel de ville, salle 2","7-2",899,{"$f":"'Saisie 1V'!E8:F8","v":0},432,{"$f":"D9-F9","v":467},{"$f":"'Saisie 1V'!G8","v":1},{"$f":"'Saisie 1V'!H8","v":1},{"$f":"H9+I9","v":2},{"$f":"F9-J9","v":430},{"$f":"'Saisie 1V'!I8:AM8","v":21},1,0,4,149,0,0,0,10,0,12,25,1,0,7,0,0,4,9,4,12,0,45,0,0,0,0,1,51,56,12,{"$f":"'Saisie 1V'!AN8:BR8","v":1},{"$f":"'Saisie 1V'!AO8:BS8","v":0},{"$f":"'Saisie 1V'!AP8:BT8","v":5}]
[0,0,0,0,{"$f":"E9/D9","v":0},{"$f":"IF(F9=0,\"\",F9/D9)","v":0.48053392658509453},{"$f":"IF(G9=0,\"\",G9/$D$9)","v":0.51946607341490547},{"$f":"IF(H9=0,\"\",H9/$F$9)","v":2.3148148148148147E-3},{"$f":"IF(I9=0,\"\",I9/$F$9)","v":2.3148148148148147E-3},{"$f":"IF(J9=0,\"\",J9/$F$9)","v":4.6296296296296294E-3},null,{"$f":"L9/$K$9","v":4.8837209302325581E-2},2.3255813953488372E-3,0,9.3023255813953487E-3,0.34651162790697676,0,0,0,2.3255813953488372E-2,0,2.7906976744186046E-2,5.8139534883720929E-2,2.3255813953488372E-3,0,1.627906976744186E-2,0,0,9.3023255813953487E-3,2.0930232558139535E-2,9.3023255813953487E-3,2.7906976744186046E-2,0,0.10465116279069768,0,0,{"$f":"AK9/$K$9","v":0},0,2.3255813953488372E-3,0.1186046511627907,0.13023255813953488,2.7906976744186046E-2,{"$f":"AQ9/$K$9","v":2.3255813953488372E-3},0,1.1627906976744186E-2]
[3,"Mendès-France, maternelle","7-2",884,{"$f":"'Saisie 1V'!E9:F9","v":0},396,{"$f":"D11-F11","v":488},{"$f":"'Saisie 1V'!G9","v":10},{"$f":"'Saisie 1V'!H9","v":14},{"$f":"H11+I11","v":24},{"$f":"F11-J11","v":372},{"$f":"'Saisie 1V'!I9:AM9","v":48},0,0,5,67,0,1,0,15,0,5,41,0,0,5,1,3,5,8,7,17,0,39,0,0,1,0,3,37,39,12,{"$f":"'Saisie 1V'!AN9:BR9","v":2},{"$f":"'Saisie 1V'!AO9:BS9","v":2},{"$f":"'Saisie 1V'!AP9:BT9","v":9}]
[0,0,0,0,{"$f":"E11/D11","v":0},{"$f":"IF(F11=0,\"\",F11/D11)","v":0.44796380090497739},{"$f":"IF(G11=0,\"\",G11/$D$11)","v":0.55203619909502266},{"$f":"IF(H11=0,\"\",H11/$F$11)","v":2.5252525252525252E-2},{"$f":"IF(I11=0,\"\",I11/$F$11)","v":3.5353535353535352E-2},{"$f":"IF(J11=0,\"\",J11/$F$11)","v":6.0606060606060608E-2},null,{"$f":"L11/$K$11","v":0.12903225806451613},0,0,1.3440860215053764E-2,0.18010752688172044,0,2.6881720430107529E-3,0,4.0322580645161289E-2,0,1.3440860215053764E-2,0.11021505376344086,0,0,1.3440860215053764E-2,2.6881720430107529E-3,8.0645161290322578E-3,1.3440860215053764E-2,2.1505376344086023E-2,1.8817204301075269E-2,4.5698924731182797E-2,0,0.10483870967741936,0,0,{"$f":"AK11/$K$11","v":2.6881720430107529E-3},0,8.0645161290322578E-3,9.9462365591397844E-2,0.10483870967741936,3.2258064516129031E-2,{"$f":"AQ11/$K$11","v":5.3763440860215058E-3},5.3763440860215058E-3,2.4193548387096774E-2]
[4,"Defferre, maternelle","7-2",958,{"$f":"'Saisie 1V'!E10:F10","v":0},394,{"$f":"D13-F13","v":564},{"$f":"'Saisie 1V'!G10","v":6},{"$f":"'Saisie 1V'!H10","v":10},{"$f":"H13+I13","v":16},{"$f":"F13-J13","v":378},{"$f":"'Saisie 1V'!I10:AM10","v":59},0,0,23,59,0,1,0,5,0,6,33,0,0,18,0,0,5,9,2,23,0,45,0,0,0,0,3,26,41,6,{"$f":"'Saisie 1V'!AN10:BR10","v":0},{"$f":"'Saisie 1V'!AO10:BS10","v":0},{"$f":"'Saisie 1V'!AP10:BT10","v":14}]
[0,0,0,0,{"$f":"E13/D13","v":0},{"$f":"IF(F13=0,\"\",F13/D13)","v":0.41127348643006262},{"$f":"IF(G13=0,\"\",G13/$D$13)","v":0.58872651356993733},{"$f":"IF(H13=0,\"\",H13/$F$13)","v":1.5228426395939087E-2},{"$f":"IF(I13=0,\"\",I13/$F$13)","v":2.5380710659898477E-2},{"$f":"IF(J13=0,\"\",J13/$F$13)","v":4.060913705583756E-2},null,{"$f":"L13/$K$13","v":0.15608465608465608},0,0,6.0846560846560843E-2,0.15608465608465608,0,2.6455026455026454E-3,0,1.3227513227513227E-2,0,1.5873015873015872E-2,8.7301587301587297E-2,0,0,4.7619047619047616E-2,0,0,1.3227513227513227E-2,2.3809523809523808E-2,5.2910052910052907E-3,6.0846560846560843E-2,0,0.11904761904761904,0,0,{"$f":"AK13/$K$13","v":0},0,7.9365079365079361E-3,6.8783068783068779E-2,0.10846560846560846,1.5873015873015872E-2,{"$f":"AQ13/$K$13","v":0},0,3.7037037037037035E-2]
[5,"Port, Maison de quartier","7-2",1070,{"$f":"'Saisie 1V'!E11:F11","v":0},429,{"$f":"D15-F15","v":641},{"$f":"'Saisie 1V'!G11","v":11},{"$f":"'Saisie 1V'!H11","v":5},{"$f":"H15+I15","v":16},{"$f":"F15-J15","v":413},{"$f":"'Saisie 1V'!I11:AM11","v":37},0,0,2,94,0,1,0,10,0,5,35,1,0,12,0,0,3,11,13,18,1,48,0,0,0,0,0,36,55,11,{"$f":"'Saisie 1V'!AN11:BR11","v":2},{"$f":"'Saisie 1V'!AO11:BS11","v":3},{"$f":"'Saisie 1V'!AP11:BT11","v":15}]
[0,0,0,0,{"$f":"E15/D15","v":0},{"$f":"IF(F15=0,\"\",F15/D15)","v":0.40093457943925231},{"$f":"IF(G15=0,\"\",G15/$D$15)","v":0.59906542056074763},{"$f":"IF(H15=0,\"\",H15/$F$15)","v":2.564102564102564E-2},{"$f":"IF(I15=0,\"\",I15/$F$15)","v":1.1655011655011656E-2},{"$f":"IF(J15=0,\"\",J15/$F$15)","v":3.7296037296037296E-2},null,{"$f":"L15/$K$15","v":8.9588377723970949E-2},0,0,4.8426150121065378E-3,0.22760290556900725,0,2.4213075060532689E-3,0,2.4213075060532687E-2,0,1.2106537530266344E-2,8.4745762711864403E-2,2.4213075060532689E-3,0,2.9055690072639227E-2,0,0,7.2639225181598066E-3,2.6634382566585957E-2,3.1476997578692496E-2,4.3583535108958835E-2,2.4213075060532689E-3,0.11622276029055691,0,0,{"$f":"AK15/$K$15","v":0},0,0,8.7167070217917669E-2,0.13317191283292978,2.6634382566585957E-2,{"$f":"AQ15/$K$15","v":4.8426150121065378E-3},7.2639225181598066E-3,3.6319612590799029E-2]
[6,"La Source, élémentaire","7-2",965,{"$f":"'Saisie 1V'!E12:F12","v":0},404,{"$f":"D17-F17","v":561},{"$f":"'Saisie 1V'!G12","v":12},{"$f":"'Saisie 1V'!H12","v":6},{"$f":"H17+I17","v":18},{"$f":"F17-J17","v":386},{"$f":"'Saisie 1V'!I12:AM12","v":49},0,3,0,79,0,1,0,10,0,12,35,0,0,13,0,0,2,11,11,13,0,55,0,0,0,0,2,22,45,11,{"$f":"'Saisie 1V'!AN12:BR12","v":2},{"$f":"'Saisie 1V'!AO12:BS12","v":0},{"$f":"'Saisie 1V'!AP12:BT12","v":10}]
[0,0,0,0,{"$f":"E17/D17","v":0},{"$f":"IF(F17=0,\"\",F17/D17)","v":0.41865284974093264},{"$f":"IF(G17=0,\"\",G17/$D$17)","v":0.58134715025906736},{"$f":"IF(H17=0,\"\",H17/$F$17)","v":2.9702970297029702E-2},{"$f":"IF(I17=0,\"\",I17/$F$17)","v":1.4851485148514851E-2},{"$f":"IF(J17=0,\"\",J17/$F$17)","v":4.4554455445544552E-2},null,{"$f":"L17/$K$17","v":0.12694300518134716},0,7.7720207253886009E-3,0,0.20466321243523317,0,2.5906735751295338E-3,0,2.5906735751295335E-2,0,3.1088082901554404E-2,9.0673575129533682E-2,0,0,3.367875647668394E-2,0,0,5.1813471502590676E-3,2.8497409326424871E-2,2.8497409326424871E-2,3.367875647668394E-2,0,0.14248704663212436,0,0,{"$f":"AK17/$K$17","v":0},0,5.1813471502590676E-3,5.6994818652849742E-2,0.11658031088082901,2.8497409326424871E-2,{"$f":"AQ17/$K$17","v":5.1813471502590676E-3},0,2.5906735751295335E-2]
[7,"Césaire, élementaire","7-2",1310,{"$f":"'Saisie 1V'!E13:F13","v":0},604,{"$f":"D19-F19","v":706},{"$f":"'Saisie 1V'!G13","v":16},{"$f":"'Saisie 1V'!H13","v":5},{"$f":"H19+I19","v":21},{"$f":"F19-J19","v":583},{"$f":"'Saisie 1V'!I13:AM13","v":64},0,0,1,161,0,1,1,7,0,10,41,1,0,24,0,0,4,21,12,42,0,56,0,0,1,0,0,38,69,5,{"$f":"'Saisie 1V'!AN13:BR13","v":3},{"$f":"'Saisie 1V'!AO13:BS13","v":0},{"$f":"'Saisie 1V'!AP13:BT13","v":21}]
[0,0,0,0,{"$f":"E19/D19","v":0},{"$f":"IF(F19=0,\"\",F19/D19)","v":0.46106870229007635},{"$f":"IF(G19=0,\"\",G19/$D$19)","v":0.53893129770992365},{"$f":"IF(H19=0,\"\",H19/$F$19)","v":2.6490066225165563E-2},{"$f":"IF(I19=0,\"\",I19/$F$19)","v":8.2781456953642391E-3},{"$f":"IF(J19=0,\"\",J19/$F$19)","v":3.4768211920529798E-2},null,{"$f":"L19/$K$19","v":0.10977701543739279},0,0,1.7152658662092624E-3,0.27615780445969124,0,1.7152658662092624E-3,1.7152658662092624E-3,1.2006861063464836E-2,0,1.7152658662092625E-2,7.0325900514579764E-2,1.7152658662092624E-3,0,4.1166380789022301E-2,0,0,6.8610634648370496E-3,3.6020583190394515E-2,2.0583190394511151E-2,7.2041166380789029E-2,0,9.6054888507718691E-2,0,0,{"$f":"AK19/$K$19","v":1.7152658662092624E-3},0,0,6.5180102915951971E-2,0.1183533447684391,8.5763293310463125E-3,{"$f":"AQ19/$K$19","v":5.1457975986277877E-3},0,3.6020583190394515E-2]
[8,"Gerbault","7-2",1101,{"$f":"'Saisie 1V'!E14:F14","v":0},512,{"$f":"D21-F21","v":589},{"$f":"'Saisie 1V'!G14","v":10},{"$f":"'Saisie 1V'!H14","v":5},{"$f":"H21+I21","v":15},{"$f":"F21-J21","v":497},{"$f":"'Saisie 1V'!I14:AM14","v":28},0,0,3,145,0,0,0,10,0,17,38,0,0,15,0,0,4,24,14,24,0,58,0,0,0,0,1,51,51,8,{"$f":"'Saisie 1V'!AN14:BR14","v":0},{"$f":"'Saisie 1V'!AO14:BS14","v":1},{"$f":"'Saisie 1V'!AP14:BT14","v":5}]
[0,0,0,0,{"$f":"E21/D21","v":0},{"$f":"IF(F21=0,\"\",F21/D21)","v":0.46503178928247046},{"$f":"IF(G21=0,\"\",G21/$D$21)","v":0.53496821071752954},{"$f":"IF(H21=0,\"\",H21/$F$21)","v":1.953125E-2},{"$f":"IF(I21=0,\"\",I21/$F$21)","v":9.765625E-3},{"$f":"IF(J21=0,\"\",J21/$F$21)","v":2.9296875E-2},null,{"$f":"L21/$K$21","v":5.6338028169014086E-2},0,0,6.0362173038229373E-3,0.29175050301810868,0,0,0,2.0120724346076459E-2,0,3.4205231388329982E-2,7.6458752515090544E-2,0,0,3.0181086519114688E-2,0,0,8.0482897384305842E-3,4.8289738430583498E-2,2.8169014084507043E-2,4.8289738430583498E-2,0,0.11670020120724346,0,0,{"$f":"AK21/$K$21","v":0},0,2.012072434607646E-3,0.10261569416498995,0.10261569416498995,1.6096579476861168E-2,{"$f":"AQ21/$K$21","v":0},2.012072434607646E-3,1.0060362173038229E-2]
[9,"Chateaubriand, maternelle","7-2",1106,{"$f":"'Saisie 1V'!E15:F15","v":0},510,{"$f":"D23-F23","v":596},{"$f":"'Saisie 1V'!G15","v":15},{"$f":"'Saisie 1V'!H15","v":14},{"$f":"H23+I23","v":29},{"$f":"F23-J23","v":481},{"$f":"'Saisie 1V'!I15:AM15","v":49},0,0,2,97,0,4,0,11,0,10,39,1,0,20,0,0,3,15,11,37,0,75,0,0,2,0,5,20,60,8,{"$f":"'Saisie 1V'!AN15:BR15","v":1},{"$f":"'Saisie 1V'!AO15:BS15","v":0},{"$f":"'Saisie 1V'!AP15:BT15","v":11}]
[0,0,0,0,{"$f":"E23/D23","v":0},{"$f":"IF(F23=0,\"\",F23/D23)","v":0.46112115732368897},{"$f":"IF(G23=0,\"\",G23/$D$23)","v":0.53887884267631103},{"$f":"IF(H23=0,\"\",H23/$F$23)","v":2.9411764705882353E-2},{"$f":"IF(I23=0,\"\",I23/$F$23)","v":2.7450980392156862E-2},{"$f":"IF(J23=0,\"\",J23/$F$23)","v":5.6862745098039215E-2},null,{"$f":"L23/$K$23","v":0.10187110187110188},0,0,4.1580041580041582E-3,0.20166320166320167,0,8.3160083160083165E-3,0,2.286902286902287E-2,0,2.0790020790020791E-2,8.1081081081081086E-2,2.0790020790020791E-3,0,4.1580041580041582E-2,0,0,6.2370062370062374E-3,3.1185031185031187E-2,2.286902286902287E-2,7.6923076923076927E-2,0,0.15592515592515593,0,0,{"$f":"AK23/$K$23","v":4.1580041580041582E-3},0,1.0395010395010396E-2,4.1580041580041582E-2,0.12474012474012475,1.6632016632016633E-2,{"$f":"AQ23/$K$23","v":2.0790020790020791E-3},0,2.286902286902287E-2]
[10,"Allezard, maternelle","7-1",1090,{"$f":"'Saisie 1V'!E16:F16","v":0},481,{"$f":"D25-F25","v":609},{"$f":"'Saisie 1V'!G16","v":9},{"$f":"'Saisie 1V'!H16","v":7},{"$f":"H25+I25","v":16},{"$f":"F25-J25","v":465},{"$f":"'Saisie 1V'!I16:AM16","v":51},0,0,1,108,0,0,0,13,0,15,28,0,0,14,0,1,3,7,12,26,0,86,0,0,0,0,8,23,61,8,{"$f":"'Saisie 1V'!AN16:BR16","v":0},{"$f":"'Saisie 1V'!AO16:BS16","v":0},{"$f":"'Saisie 1V'!AP16:BT16","v":0}]
[0,0,0,0,{"$f":"E25/D25","v":0},{"$f":"IF(F25=0,\"\",F25/D25)","v":0.44128440366972477},{"$f":"IF(G25=0,\"\",G25/$D$25)","v":0.55871559633027523},{"$f":"IF(H25=0,\"\",H25/$F$25)","v":1.8711018711018712E-2},{"$f":"IF(I25=0,\"\",I25/$F$25)","v":1.4553014553014554E-2},{"$f":"IF(J25=0,\"\",J25/$F$25)","v":3.3264033264033266E-2},null,{"$f":"L25/$K$25","v":0.10967741935483871},0,0,2.1505376344086021E-3,0.23225806451612904,0,0,0,2.7956989247311829E-2,0,3.2258064516129031E-2,6.0215053763440864E-2,0,0,3.0107526881720432E-2,0,2.1505376344086021E-3,6.4516129032258064E-3,1.5053763440860216E-2,2.5806451612903226E-2,5.5913978494623658E-2,0,0.18494623655913978,0,0,{"$f":"AK25/$K$25","v":0},0,1.7204301075268817E-2,4.9462365591397849E-2,0.13118279569892474,1.7204301075268817E-2,{"$f":"AQ25/$K$25","v":0},0,0]
[11,"Allezard, élémentaire","7-1",808,{"$f":"'Saisie 1V'!E17:F17","v":0},386,{"$f":"D27-F27","v":422},{"$f":"'Saisie 1V'!G17","v":9},{"$f":"'Saisie 1V'!H17","v":7},{"$f":"H27+I27","v":16},{"$f":"F27-J27","v":370},{"$f":"'Saisie 1V'!I17:AM17","v":16},0,0,2,88,0,1,0,7,0,14,32,1,0,14,0,0,1,20,7,10,0,63,0,0,0,0,1,24,58,6,{"$f":"'Saisie 1V'!AN17:BR17","v":0},{"$f":"'Saisie 1V'!AO17:BS17","v":0},{"$f":"'Saisie 1V'!AP17:BT17","v":5}]
[0,0,0,0,{"$f":"E27/D27","v":0},{"$f":"IF(F27=0,\"\",F27/D27)","v":0.4777227722772277},{"$f":"IF(G27=0,\"\",G27/$D$27)","v":0.5222772277227723},{"$f":"IF(H27=0,\"\",H27/$F$27)","v":2.3316062176165803E-2},{"$f":"IF(I27=0,\"\",I27/$F$27)","v":1.8134715025906734E-2},{"$f":"IF(J27=0,\"\",J27/$F$27)","v":4.145077720207254E-2},null,{"$f":"L27/$K$27","v":4.3243243243243246E-2},0,0,5.4054054054054057E-3,0.23783783783783785,0,2.7027027027027029E-3,0,1.891891891891892E-2,0,3.783783783783784E-2,8.6486486486486491E-2,2.7027027027027029E-3,0,3.783783783783784E-2,0,0,2.7027027027027029E-3,5.4054054054054057E-2,1.891891891891892E-2,2.7027027027027029E-2,0,0.17027027027027028,0,0,{"$f":"AK27/$K$27","v":0},0,2.7027027027027029E-3,6.4864864864864868E-2,0.15675675675675677,1.6216216216216217E-2,{"$f":"AQ27/$K$27","v":0},0,1.3513513513513514E-2]
[12,"Hérédia, élementaire","7-2",920,{"$f":"'Saisie 1V'!E18:F18","v":0},430,{"$f":"D29-F29","v":490},{"$f":"'Saisie 1V'!G18","v":9},{"$f":"'Saisie 1V'!H18","v":8},{"$f":"H29+I29","v":17},{"$f":"F29-J29","v":413},{"$f":"'Saisie 1V'!I18:AM18","v":40},0,0,4,89,0,3,0,6,1,13,50,1,0,11,0,0,2,15,7,18,0,52,0,0,0,0,0,33,58,4,{"$f":"'Saisie 1V'!AN18:BR18","v":0},{"$f":"'Saisie 1V'!AO18:BS18","v":0},{"$f":"'Saisie 1V'!AP18:BT18","v":6}]
[0,0,0,0,{"$f":"E29/D29","v":0},{"$f":"IF(F29=0,\"\",F29/D29)","v":0.46739130434782611},{"$f":"IF(G29=0,\"\",G29/$D$29)","v":0.53260869565217395},{"$f":"IF(H29=0,\"\",H29/$F$29)","v":2.0930232558139535E-2},{"$f":"IF(I29=0,\"\",I29/$F$29)","v":1.8604651162790697E-2},{"$f":"IF(J29=0,\"\",J29/$F$29)","v":3.9534883720930232E-2},null,{"$f":"L29/$K$29","v":9.6852300242130748E-2},0,0,9.6852300242130755E-3,0.21549636803874092,0,7.2639225181598066E-3,0,1.4527845036319613E-2,2.4213075060532689E-3,3.1476997578692496E-2,0.12106537530266344,2.4213075060532689E-3,0,2.6634382566585957E-2,0,0,4.8426150121065378E-3,3.6319612590799029E-2,1.6949152542372881E-2,4.3583535108958835E-2,0,0.12590799031476999,0,0,{"$f":"AK29/$K$29","v":0},0,0,7.990314769975787E-2,0.14043583535108958,9.6852300242130755E-3,{"$f":"AQ29/$K$29","v":0},0,1.4527845036319613E-2]
[13,"Péguy, élémentaire","7-2",962,{"$f":"'Saisie 1V'!E19:F19","v":0},390,{"$f":"D31-F31","v":572},{"$f":"'Saisie 1V'!G19","v":3},{"$f":"'Saisie 1V'!H19","v":3},{"$f":"H31+I31","v":6},{"$f":"F31-J31","v":384},{"$f":"'Saisie 1V'!I19:AM19","v":41},0,0,1,100,0,2,0,6,0,15,27,0,0,15,0,0,3,11,5,20,0,49,0,0,0,0,2,21,44,6,{"$f":"'Saisie 1V'!AN19:BR19","v":1},{"$f":"'Saisie 1V'!AO19:BS19","v":0},{"$f":"'Saisie 1V'!AP19:BT19","v":15}]
[0,0,0,0,{"$f":"E31/D31","v":0},{"$f":"IF(F31=0,\"\",F31/D31)","v":0.40540540540540543},{"$f":"IF(G31=0,\"\",G31/$D$31)","v":0.59459459459459463},{"$f":"IF(H31=0,\"\",H31/$F$31)","v":7.6923076923076927E-3},{"$f":"IF(I31=0,\"\",I31/$F$31)","v":7.6923076923076927E-3},{"$f":"IF(J31=0,\"\",J31/$F$31)","v":1.5384615384615385E-2},null,{"$f":"L31/$K$31","v":0.10677083333333333},0,0,2.6041666666666665E-3,0.26041666666666669,0,5.208333333333333E-3,0,1.5625E-2,0,3.90625E-2,7.03125E-2,0,0,3.90625E-2,0,0,7.8125E-3,2.8645833333333332E-2,1.3020833333333334E-2,5.2083333333333336E-2,0,0.12760416666666666,0,0,{"$f":"AK31/$K$31","v":0},0,5.208333333333333E-3,5.46875E-2,0.11458333333333333,1.5625E-2,{"$f":"AQ31/$K$31","v":2.6041666666666665E-3},0,3.90625E-2]
[14,"Pascal, élémentaire","7-2",977,{"$f":"'Saisie 1V'!E20:F20","v":0},370,{"$f":"D33-F33","v":607},{"$f":"'Saisie 1V'!G20","v":12},{"$f":"'Saisie 1V'!H20","v":12},{"$f":"H33+I33","v":24},{"$f":"F33-J33","v":346},{"$f":"'Saisie 1V'!I20:AM20","v":28},0,0,0,75,0,1,0,3,0,5,22,0,0,20,0,0,5,11,9,12,0,68,0,0,0,0,2,20,37,8,{"$f":"'Saisie 1V'!AN20:BR20","v":0},{"$f":"'Saisie 1V'!AO20:BS20","v":5},{"$f":"'Saisie 1V'!AP20:BT20","v":15}]
[0,0,0,0,{"$f":"E33/D33","v":0},{"$f":"IF(F33=0,\"\",F33/D33)","v":0.37871033776867963},{"$f":"IF(G33=0,\"\",G33/$D$33)","v":0.62128966223132032},{"$f":"IF(H33=0,\"\",H33/$F$33)","v":3.2432432432432434E-2},{"$f":"IF(I33=0,\"\",I33/$F$33)","v":3.2432432432432434E-2},{"$f":"IF(J33=0,\"\",J33/$F$33)","v":6.4864864864864868E-2},null,{"$f":"L33/$K$33","v":8.0924855491329481E-2},0,0,0,0.21676300578034682,0,2.8901734104046241E-3,0,8.670520231213872E-3,0,1.4450867052023121E-2,6.358381502890173E-2,0,0,5.7803468208092484E-2,0,0,1.4450867052023121E-2,3.1791907514450865E-2,2.6011560693641619E-2,3.4682080924855488E-2,0,0.19653179190751446,0,0,{"$f":"AK33/$K$33","v":0},0,5.7803468208092483E-3,5.7803468208092484E-2,0.1069364161849711,2.3121387283236993E-2,{"$f":"AQ33/$K$33","v":0},1.4450867052023121E-2,4.3352601156069363E-2]
[15,"Monge, élémentaire","7-2",851,{"$f":"'Saisie 1V'!E21:F21","v":0},418,{"$f":"D35-F35","v":433},{"$f":"'Saisie 1V'!G21","v":12},{"$f":"'Saisie 1V'!H21","v":5},{"$f":"H35+I35","v":17},{"$f":"F35-J35","v":401},{"$f":"'Saisie 1V'!I21:AM21","v":36},0,0,1,85,0,0,0,8,0,6,34,0,0,10,0,0,5,20,7,17,0,56,0,0,0,0,7,15,60,22,{"$f":"'Saisie 1V'!AN21:BR21","v":0},{"$f":"'Saisie 1V'!AO21:BS21","v":2},{"$f":"'Saisie 1V'!AP21:BT21","v":10}]
[0,0,0,0,{"$f":"E35/D35","v":0},{"$f":"IF(F35=0,\"\",F35/D35)","v":0.49118683901292598},{"$f":"IF(G35=0,\"\",G35/$D$35)","v":0.50881316098707408},{"$f":"IF(H35=0,\"\",H35/$F$35)","v":2.8708133971291867E-2},{"$f":"IF(I35=0,\"\",I35/$F$35)","v":1.1961722488038277E-2},{"$f":"IF(J35=0,\"\",J35/$F$35)","v":4.0669856459330141E-2},null,{"$f":"L35/$K$35","v":8.9775561097256859E-2},0,0,2.4937655860349127E-3,0.21197007481296759,0,0,0,1.9950124688279301E-2,0,1.4962593516209476E-2,8.4788029925187039E-2,0,0,2.4937655860349128E-2,0,0,1.2468827930174564E-2,4.9875311720698257E-2,1.7456359102244388E-2,4.2394014962593519E-2,0,0.1396508728179551,0,0,{"$f":"AK35/$K$35","v":0},0,1.7456359102244388E-2,3.7406483790523692E-2,0.14962593516209477,5.4862842892768077E-2,{"$f":"AQ35/$K$35","v":0},4.9875311720698253E-3,2.4937655860349128E-2]
[16,"Monge, maternelle","7-2",1002,{"$f":"'Saisie 1V'!E22:F22","v":0},447,{"$f":"D37-F37","v":555},{"$f":"'Saisie 1V'!G22","v":8},{"$f":"'Saisie 1V'!H22","v":7},{"$f":"H37+I37","v":15},{"$f":"F37-J37","v":432},{"$f":"'Saisie 1V'!I22:AM22","v":42},0,0,1,98,0,0,0,6,0,13,26,1,0,17,0,0,2,23,11,28,0,65,0,0,1,0,2,34,45,5,{"$f":"'Saisie 1V'!AN22:BR22","v":0},{"$f":"'Saisie 1V'!AO22:BS22","v":0},{"$f":"'Saisie 1V'!AP22:BT22","v":12}]
[0,0,0,0,{"$f":"E37/D37","v":0},{"$f":"IF(F37=0,\"\",F37/D37)","v":0.44610778443113774},{"$f":"IF(G37=0,\"\",G37/$D$37)","v":0.55389221556886226},{"$f":"IF(H37=0,\"\",H37/$F$37)","v":1.7897091722595078E-2},{"$f":"IF(I37=0,\"\",I37/$F$37)","v":1.5659955257270694E-2},{"$f":"IF(J37=0,\"\",J37/$F$37)","v":3.3557046979865772E-2},null,{"$f":"L37/$K$37","v":9.7222222222222224E-2},0,0,2.3148148148148147E-3,0.22685185185185186,0,0,0,1.3888888888888888E-2,0,3.0092592592592591E-2,6.0185185185185182E-2,2.3148148148148147E-3,0,3.9351851851851853E-2,0,0,4.6296296296296294E-3,5.3240740740740741E-2,2.5462962962962962E-2,6.4814814814814811E-2,0,0.15046296296296297,0,0,{"$f":"AK37/$K$37","v":2.3148148148148147E-3},0,4.6296296296296294E-3,7.8703703703703706E-2,0.10416666666666667,1.1574074074074073E-2,{"$f":"AQ37/$K$37","v":0},0,2.7777777777777776E-2]
[17,"Lagrange, élémentaire","7-2",992,{"$f":"'Saisie 1V'!E23:F23","v":0},476,{"$f":"D39-F39","v":516},{"$f":"'Saisie 1V'!G23","v":9},{"$f":"'Saisie 1V'!H23","v":5},{"$f":"H39+I39","v":14},{"$f":"F39-J39","v":462},{"$f":"'Saisie 1V'!I23:AM23","v":45},0,0,0,115,0,2,1,18,0,15,46,0,0,9,0,0,1,14,14,25,0,60,0,0,0,0,1,24,60,7,{"$f":"'Saisie 1V'!AN23:BR23","v":0},{"$f":"'Saisie 1V'!AO23:BS23","v":0},{"$f":"'Saisie 1V'!AP23:BT23","v":5}]
[0,0,0,0,{"$f":"E39/D39","v":0},{"$f":"IF(F39=0,\"\",F39/D39)","v":0.47983870967741937},{"$f":"IF(G39=0,\"\",G39/$D$39)","v":0.52016129032258063},{"$f":"IF(H39=0,\"\",H39/$F$39)","v":1.8907563025210083E-2},{"$f":"IF(I39=0,\"\",I39/$F$39)","v":1.050420168067227E-2},{"$f":"IF(J39=0,\"\",J39/$F$39)","v":2.9411764705882353E-2},null,{"$f":"L39/$K$39","v":9.7402597402597407E-2},0,0,0,0.24891774891774893,0,4.329004329004329E-3,2.1645021645021645E-3,3.896103896103896E-2,0,3.2467532467532464E-2,9.9567099567099568E-2,0,0,1.948051948051948E-2,0,0,2.1645021645021645E-3,3.0303030303030304E-2,3.0303030303030304E-2,5.4112554112554112E-2,0,0.12987012987012986,0,0,{"$f":"AK39/$K$39","v":0},0,2.1645021645021645E-3,5.1948051948051951E-2,0.12987012987012986,1.5151515151515152E-2,{"$f":"AQ39/$K$39","v":0},0,1.0822510822510822E-2]
[18,"Conservatoire de musique M.Dadi","7-1",1035,{"$f":"'Saisie 1V'!E24:F24","v":0},493,{"$f":"D41-F41","v":542},{"$f":"'Saisie 1V'!G24","v":12},{"$f":"'Saisie 1V'!H24","v":5},{"$f":"H41+I41","v":17},{"$f":"F41-J41","v":476},{"$f":"'Saisie 1V'!I24:AM24","v":48},0,0,1,132,0,1,0,13,0,11,30,1,0,8,0,0,2,23,4,10,4,57,0,0,0,0,0,28,89,10,{"$f":"'Saisie 1V'!AN24:BR24","v":1},{"$f":"'Saisie 1V'!AO24:BS24","v":1},{"$f":"'Saisie 1V'!AP24:BT24","v":2}]
[0,0,0,0,{"$f":"E41/D41","v":0},{"$f":"IF(F41=0,\"\",F41/D41)","v":0.47632850241545893},{"$f":"IF(G41=0,\"\",G41/$D$41)","v":0.52367149758454101},{"$f":"IF(H41=0,\"\",H41/$F$41)","v":2.434077079107505E-2},{"$f":"IF(I41=0,\"\",I41/$F$41)","v":1.0141987829614604E-2},{"$f":"IF(J41=0,\"\",J41/$F$41)","v":3.4482758620689655E-2},null,{"$f":"L41/$K$41","v":0.10084033613445378},0,0,2.1008403361344537E-3,0.27731092436974791,0,2.1008403361344537E-3,0,2.7310924369747899E-2,0,2.3109243697478993E-2,6.3025210084033612E-2,2.1008403361344537E-3,0,1.680672268907563E-2,0,0,4.2016806722689074E-3,4.8319327731092439E-2,8.4033613445378148E-3,2.100840336134454E-2,8.4033613445378148E-3,0.11974789915966387,0,0,{"$f":"AK41/$K$41","v":0},0,0,5.8823529411764705E-2,0.18697478991596639,2.100840336134454E-2,{"$f":"AQ41/$K$41","v":2.1008403361344537E-3},2.1008403361344537E-3,4.2016806722689074E-3]
[19,"Eboué, élémentaire","7-2",842,{"$f":"'Saisie 1V'!E25:F25","v":0},371,{"$f":"D43-F43","v":471},{"$f":"'Saisie 1V'!G25","v":6},{"$f":"'Saisie 1V'!H25","v":8},{"$f":"H43+I43","v":14},{"$f":"F43-J43","v":357},{"$f":"'Saisie 1V'!I25:AM25","v":35},0,0,2,82,0,2,0,7,0,6,25,1,0,7,0,0,6,8,3,12,0,47,0,0,0,0,2,32,70,4,{"$f":"'Saisie 1V'!AN25:BR25","v":0},{"$f":"'Saisie 1V'!AO25:BS25","v":1},{"$f":"'Saisie 1V'!AP25:BT25","v":5}]
[0,0,0,0,{"$f":"E43/D43","v":0},{"$f":"IF(F43=0,\"\",F43/D43)","v":0.44061757719714967},{"$f":"IF(G43=0,\"\",G43/$D$43)","v":0.55938242280285033},{"$f":"IF(H43=0,\"\",H43/$F$43)","v":1.6172506738544475E-2},{"$f":"IF(I43=0,\"\",I43/$F$43)","v":2.15633423180593E-2},{"$f":"IF(J43=0,\"\",J43/$F$43)","v":3.7735849056603772E-2},null,{"$f":"L43/$K$43","v":9.8039215686274508E-2},0,0,5.6022408963585435E-3,0.22969187675070027,0,5.6022408963585435E-3,0,1.9607843137254902E-2,0,1.680672268907563E-2,7.0028011204481794E-2,2.8011204481792717E-3,0,1.9607843137254902E-2,0,0,1.680672268907563E-2,2.2408963585434174E-2,8.4033613445378148E-3,3.3613445378151259E-2,0,0.13165266106442577,0,0,{"$f":"AK43/$K$43","v":0},0,5.6022408963585435E-3,8.9635854341736695E-2,0.19607843137254902,1.1204481792717087E-2,{"$f":"AQ43/$K$43","v":0},2.8011204481792717E-3,1.4005602240896359E-2]
[20,"Eboué, maternelle","7-2",735,{"$f":"'Saisie 1V'!E26:F26","v":0},312,{"$f":"D45-F45","v":423},{"$f":"'Saisie 1V'!G26","v":6},{"$f":"'Saisie 1V'!H26","v":7},{"$f":"H45+I45","v":13},{"$f":"F45-J45","v":299},{"$f":"'Saisie 1V'!I26:AM26","v":56},0,0,0,91,0,1,0,7,0,5,14,0,0,8,0,0,3,6,7,20,0,27,0,0,0,0,3,18,23,4,{"$f":"'Saisie 1V'!AN26:BR26","v":0},{"$f":"'Saisie 1V'!AO26:BS26","v":1},{"$f":"'Saisie 1V'!AP26:BT26","v":5}]
[0,0,0,0,{"$f":"E45/D45","v":0},{"$f":"IF(F45=0,\"\",F45/D45)","v":0.42448979591836733},{"$f":"IF(G45=0,\"\",G45/$D$45)","v":0.57551020408163267},{"$f":"IF(H45=0,\"\",H45/$F$45)","v":1.9230769230769232E-2},{"$f":"IF(I45=0,\"\",I45/$F$45)","v":2.2435897435897436E-2},{"$f":"IF(J45=0,\"\",J45/$F$45)","v":4.1666666666666664E-2},null,{"$f":"L45/$K$45","v":0.18729096989966554},0,0,0,0.30434782608695654,0,3.3444816053511705E-3,0,2.3411371237458192E-2,0,1.6722408026755852E-2,4.6822742474916385E-2,0,0,2.6755852842809364E-2,0,0,1.0033444816053512E-2,2.0066889632107024E-2,2.3411371237458192E-2,6.6889632107023408E-2,0,9.0301003344481601E-2,0,0,{"$f":"AK45/$K$45","v":0},0,1.0033444816053512E-2,6.0200668896321072E-2,7.6923076923076927E-2,1.3377926421404682E-2,{"$f":"AQ45/$K$45","v":0},3.3444816053511705E-3,1.6722408026755852E-2]
[21,"Le Cléac'h, maternelle","7-2",972,{"$f":"'Saisie 1V'!E27:F27","v":0},424,{"$f":"D47-F47","v":548},{"$f":"'Saisie 1V'!G27","v":8},{"$f":"'Saisie 1V'!H27","v":6},{"$f":"H47+I47","v":14},{"$f":"F47-J47","v":410},{"$f":"'Saisie 1V'!I27:AM27","v":38},0,0,2,90,0,0,0,8,1,6,35,1,0,8,0,0,1,11,10,24,0,51,0,0,0,0,1,18,79,7,{"$f":"'Saisie 1V'!AN27:BR27","v":1},{"$f":"'Saisie 1V'!AO27:BS27","v":0},{"$f":"'Saisie 1V'!AP27:BT27","v":18}]
[0,0,0,0,{"$f":"E47/D47","v":0},{"$f":"IF(F47=0,\"\",F47/D47)","v":0.43621399176954734},{"$f":"IF(G47=0,\"\",G47/$D$47)","v":0.56378600823045266},{"$f":"IF(H47=0,\"\",H47/$F$47)","v":1.8867924528301886E-2},{"$f":"IF(I47=0,\"\",I47/$F$47)","v":1.4150943396226415E-2},{"$f":"IF(J47=0,\"\",J47/$F$47)","v":3.3018867924528301E-2},null,{"$f":"L47/$K$47","v":9.2682926829268292E-2},0,0,4.8780487804878049E-3,0.21951219512195122,0,0,0,1.9512195121951219E-2,2.4390243902439024E-3,1.4634146341463415E-2,8.5365853658536592E-2,2.4390243902439024E-3,0,1.9512195121951219E-2,0,0,2.4390243902439024E-3,2.6829268292682926E-2,2.4390243902439025E-2,5.8536585365853662E-2,0,0.12439024390243902,0,0,{"$f":"AK47/$K$47","v":0},0,2.4390243902439024E-3,4.3902439024390241E-2,0.1926829268292683,1.7073170731707318E-2,{"$f":"AQ47/$K$47","v":2.4390243902439024E-3},0,4.3902439024390241E-2]
[22,"Beuvin, maternelle","7-2",852,{"$f":"'Saisie 1V'!E28:F28","v":0},390,{"$f":"D49-F49","v":462},{"$f":"'Saisie 1V'!G28","v":4},{"$f":"'Saisie 1V'!H28","v":6},{"$f":"H49+I49","v":10},{"$f":"F49-J49","v":380},{"$f":"'Saisie 1V'!I28:AM28","v":34},0,0,2,79,0,0,0,6,0,11,18,1,0,13,0,0,1,11,5,16,0,75,0,0,0,0,2,34,58,11,{"$f":"'Saisie 1V'!AN28:BR28","v":1},{"$f":"'Saisie 1V'!AO28:BS28","v":1},{"$f":"'Saisie 1V'!AP28:BT28","v":1}]
[0,0,0,0,{"$f":"E49/D49","v":0},{"$f":"IF(F49=0,\"\",F49/D49)","v":0.45774647887323944},{"$f":"IF(G49=0,\"\",G49/$D$49)","v":0.54225352112676062},{"$f":"IF(H49=0,\"\",H49/$F$49)","v":1.0256410256410256E-2},{"$f":"IF(I49=0,\"\",I49/$F$49)","v":1.5384615384615385E-2},{"$f":"IF(J49=0,\"\",J49/$F$49)","v":2.564102564102564E-2},null,{"$f":"L49/$K$49","v":8.9473684210526316E-2},0,0,5.263157894736842E-3,0.20789473684210527,0,0,0,1.5789473684210527E-2,0,2.8947368421052631E-2,4.736842105263158E-2,2.631578947368421E-3,0,3.4210526315789476E-2,0,0,2.631578947368421E-3,2.8947368421052631E-2,1.3157894736842105E-2,4.2105263157894736E-2,0,0.19736842105263158,0,0,{"$f":"AK49/$K$49","v":0},0,5.263157894736842E-3,8.9473684210526316E-2,0.15263157894736842,2.8947368421052631E-2,{"$f":"AQ49/$K$49","v":2.631578947368421E-3},2.631578947368421E-3,2.631578947368421E-3]
[23,"Halage, RPA","8-1",1009,{"$f":"'Saisie 1V'!E29:F29","v":0},616,{"$f":"D51-F51","v":393},{"$f":"'Saisie 1V'!G29","v":6},{"$f":"'Saisie 1V'!H29","v":9},{"$f":"H51+I51","v":15},{"$f":"F51-J51","v":601},{"$f":"'Saisie 1V'!I29:AM29","v":18},0,0,0,192,0,1,0,9,0,16,60,0,0,19,0,0,1,9,5,26,0,65,0,0,2,0,2,52,110,13,{"$f":"'Saisie 1V'!AN29:BR29","v":0},{"$f":"'Saisie 1V'!AO29:BS29","v":1},{"$f":"'Saisie 1V'!AP29:BT29","v":0}]
[0,0,0,0,{"$f":"E51/D51","v":0},{"$f":"IF(F51=0,\"\",F51/D51)","v":0.61050545094152631},{"$f":"IF(G51=0,\"\",G51/$D$51)","v":0.38949454905847375},{"$f":"IF(H51=0,\"\",H51/$F$51)","v":9.74025974025974E-3},{"$f":"IF(I51=0,\"\",I51/$F$51)","v":1.461038961038961E-2},{"$f":"IF(J51=0,\"\",J51/$F$51)","v":2.4350649350649352E-2},null,{"$f":"L51/$K$51","v":2.9950083194675542E-2},0,0,0,0.3194675540765391,0,1.6638935108153079E-3,0,1.4975041597337771E-2,0,2.6622296173044926E-2,9.9833610648918464E-2,0,0,3.1613976705490848E-2,0,0,1.6638935108153079E-3,1.4975041597337771E-2,8.3194675540765387E-3,4.3261231281198007E-2,0,0.10815307820299501,0,0,{"$f":"AK51/$K$51","v":3.3277870216306157E-3},0,3.3277870216306157E-3,8.6522462562396013E-2,0.18302828618968386,2.1630615640599003E-2,{"$f":"AQ51/$K$51","v":0},1.6638935108153079E-3,0]
[24,"Beuvin, élémentaire","8-2",685,{"$f":"'Saisie 1V'!E30:F30","v":0},278,{"$f":"D53-F53","v":407},{"$f":"'Saisie 1V'!G30","v":5},{"$f":"'Saisie 1V'!H30","v":4},{"$f":"H53+I53","v":9},{"$f":"F53-J53","v":269},{"$f":"'Saisie 1V'!I30:AM30","v":42},0,0,0,71,0,0,0,4,0,7,18,1,0,11,0,0,3,7,6,5,0,28,0,0,0,0,5,14,43,1,{"$f":"'Saisie 1V'!AN30:BR30","v":0},{"$f":"'Saisie 1V'!AO30:BS30","v":0},{"$f":"'Saisie 1V'!AP30:BT30","v":3}]
[0,0,0,0,{"$f":"E53/D53","v":0},{"$f":"IF(F53=0,\"\",F53/D53)","v":0.40583941605839419},{"$f":"IF(G53=0,\"\",G53/$D$53)","v":0.59416058394160587},{"$f":"IF(H53=0,\"\",H53/$F$53)","v":1.7985611510791366E-2},{"$f":"IF(I53=0,\"\",I53/$F$53)","v":1.4388489208633094E-2},{"$f":"IF(J53=0,\"\",J53/$F$53)","v":3.237410071942446E-2},null,{"$f":"L53/$K$53","v":0.15613382899628253},0,0,0,0.26394052044609667,0,0,0,1.4869888475836431E-2,0,2.6022304832713755E-2,6.6914498141263934E-2,3.7174721189591076E-3,0,4.0892193308550186E-2,0,0,1.1152416356877323E-2,2.6022304832713755E-2,2.2304832713754646E-2,1.858736059479554E-2,0,0.10408921933085502,0,0,{"$f":"AK53/$K$53","v":0},0,1.858736059479554E-2,5.204460966542751E-2,0.15985130111524162,3.7174721189591076E-3,{"$f":"AQ53/$K$53","v":0},0,1.1152416356877323E-2]
[25,"LCR, rue de Bonne","8-1",1021,{"$f":"'Saisie 1V'!E31:F31","v":0},697,{"$f":"D55-F55","v":324},{"$f":"'Saisie 1V'!G31","v":11},{"$f":"'Saisie 1V'!H31","v":9},{"$f":"H55+I55","v":20},{"$f":"F55-J55","v":677},{"$f":"'Saisie 1V'!I31:AM31","v":30},0,0,4,233,0,1,0,11,0,19,71,0,0,17,0,1,2,24,7,15,0,58,0,0,0,0,1,42,121,13,{"$f":"'Saisie 1V'!AN31:BR31","v":2},{"$f":"'Saisie 1V'!AO31:BS31","v":1},{"$f":"'Saisie 1V'!AP31:BT31","v":4}]
[0,0,0,0,{"$f":"E55/D55","v":0},{"$f":"IF(F55=0,\"\",F55/D55)","v":0.68266405484818804},{"$f":"IF(G55=0,\"\",G55/$D$55)","v":0.31733594515181196},{"$f":"IF(H55=0,\"\",H55/$F$55)","v":1.5781922525107604E-2},{"$f":"IF(I55=0,\"\",I55/$F$55)","v":1.2912482065997131E-2},{"$f":"IF(J55=0,\"\",J55/$F$55)","v":2.8694404591104734E-2},null,{"$f":"L55/$K$55","v":4.4313146233382568E-2},0,0,5.9084194977843431E-3,0.34416543574593794,0,1.4771048744460858E-3,0,1.6248153618906941E-2,0,2.8064992614475627E-2,0.10487444608567208,0,0,2.5110782865583457E-2,0,1.4771048744460858E-3,2.9542097488921715E-3,3.5450516986706058E-2,1.03397341211226E-2,2.2156573116691284E-2,0,8.5672082717872966E-2,0,0,{"$f":"AK55/$K$55","v":0},0,1.4771048744460858E-3,6.2038404726735601E-2,0.17872968980797638,1.9202363367799114E-2,{"$f":"AQ55/$K$55","v":2.9542097488921715E-3},1.4771048744460858E-3,5.9084194977843431E-3]
[26,"Les Buttes, gymnase","8-1",1090,{"$f":"'Saisie 1V'!E32:F32","v":0},614,{"$f":"D57-F57","v":476},{"$f":"'Saisie 1V'!G32","v":10},{"$f":"'Saisie 1V'!H32","v":7},{"$f":"H57+I57","v":17},{"$f":"F57-J57","v":597},{"$f":"'Saisie 1V'!I32:AM32","v":29},0,0,5,170,0,1,0,13,0,20,61,0,0,24,0,0,4,9,7,24,0,57,0,0,1,0,1,54,101,9,{"$f":"'Saisie 1V'!AN32:BR32","v":0},{"$f":"'Saisie 1V'!AO32:BS32","v":1},{"$f":"'Saisie 1V'!AP32:BT32","v":6}]
[0,0,0,0,{"$f":"E57/D57","v":0},{"$f":"IF(F57=0,\"\",F57/D57)","v":0.56330275229357796},{"$f":"IF(G57=0,\"\",G57/$D$57)","v":0.43669724770642204},{"$f":"IF(H57=0,\"\",H57/$F$57)","v":1.6286644951140065E-2},{"$f":"IF(I57=0,\"\",I57/$F$57)","v":1.1400651465798045E-2},{"$f":"IF(J57=0,\"\",J57/$F$57)","v":2.7687296416938109E-2},null,{"$f":"L57/$K$57","v":4.8576214405360134E-2},0,0,8.3752093802345051E-3,0.28475711892797317,0,1.6750418760469012E-3,0,2.1775544388609715E-2,0,3.350083752093802E-2,0.10217755443886097,0,0,4.0201005025125629E-2,0,0,6.7001675041876048E-3,1.507537688442211E-2,1.1725293132328308E-2,4.0201005025125629E-2,0,9.5477386934673364E-2,0,0,{"$f":"AK57/$K$57","v":1.6750418760469012E-3},0,1.6750418760469012E-3,9.0452261306532666E-2,0.16917922948073702,1.507537688442211E-2,{"$f":"AQ57/$K$57","v":0},1.6750418760469012E-3,1.0050251256281407E-2]
[27,"Plaisance, collège","8-1",969,{"$f":"'Saisie 1V'!E33:F33","v":0},508,{"$f":"D59-F59","v":461},{"$f":"'Saisie 1V'!G33","v":8},{"$f":"'Saisie 1V'!H33","v":8},{"$f":"H59+I59","v":16},{"$f":"F59-J59","v":492},{"$f":"'Saisie 1V'!I33:AM33","v":29},0,0,0,118,0,2,2,14,0,11,48,0,0,18,0,1,3,12,6,25,0,53,0,0,0,0,1,43,87,16,{"$f":"'Saisie 1V'!AN33:BR33","v":1},{"$f":"'Saisie 1V'!AO33:BS33","v":0},{"$f":"'Saisie 1V'!AP33:BT33","v":2}]
[0,0,0,0,{"$f":"E59/D59","v":0},{"$f":"IF(F59=0,\"\",F59/D59)","v":0.5242518059855521},{"$f":"IF(G59=0,\"\",G59/$D$59)","v":0.4757481940144479},{"$f":"IF(H59=0,\"\",H59/$F$59)","v":1.5748031496062992E-2},{"$f":"IF(I59=0,\"\",I59/$F$59)","v":1.5748031496062992E-2},{"$f":"IF(J59=0,\"\",J59/$F$59)","v":3.1496062992125984E-2},null,{"$f":"L59/$K$59","v":5.894308943089431E-2},0,0,0,0.23983739837398374,0,4.0650406504065045E-3,4.0650406504065045E-3,2.8455284552845527E-2,0,2.2357723577235773E-2,9.7560975609756101E-2,0,0,3.6585365853658534E-2,0,2.0325203252032522E-3,6.0975609756097563E-3,2.4390243902439025E-2,1.2195121951219513E-2,5.08130081300813E-2,0,0.10772357723577236,0,0,{"$f":"AK59/$K$59","v":0},0,2.0325203252032522E-3,8.7398373983739841E-2,0.17682926829268292,3.2520325203252036E-2,{"$f":"AQ59/$K$59","v":2.0325203252032522E-3},0,4.0650406504065045E-3]
[28,"Hugo, maternelle","8-1",879,{"$f":"'Saisie 1V'!E34:F34","v":0},557,{"$f":"D61-F61","v":322},{"$f":"'Saisie 1V'!G34","v":2},{"$f":"'Saisie 1V'!H34","v":3},{"$f":"H61+I61","v":5},{"$f":"F61-J61","v":552},{"$f":"'Saisie 1V'!I34:AM34","v":16},0,0,3,161,0,2,0,8,0,9,37,0,0,24,0,0,0,7,5,32,0,88,0,0,0,0,0,53,98,9,{"$f":"'Saisie 1V'!AN34:BR34","v":0},{"$f":"'Saisie 1V'!AO34:BS34","v":0},{"$f":"'Saisie 1V'!AP34:BT34","v":0}]
[0,0,0,0,{"$f":"E61/D61","v":0},{"$f":"IF(F61=0,\"\",F61/D61)","v":0.63367463026166093},{"$f":"IF(G61=0,\"\",G61/$D$61)","v":0.36632536973833901},{"$f":"IF(H61=0,\"\",H61/$F$61)","v":3.5906642728904849E-3},{"$f":"IF(I61=0,\"\",I61/$F$61)","v":5.3859964093357273E-3},{"$f":"IF(J61=0,\"\",J61/$F$61)","v":8.9766606822262122E-3},null,{"$f":"L61/$K$61","v":2.8985507246376812E-2},0,0,5.434782608695652E-3,0.29166666666666669,0,3.6231884057971015E-3,0,1.4492753623188406E-2,0,1.6304347826086956E-2,6.7028985507246383E-2,0,0,4.3478260869565216E-2,0,0,0,1.2681159420289856E-2,9.057971014492754E-3,5.7971014492753624E-2,0,0.15942028985507245,0,0,{"$f":"AK61/$K$61","v":0},0,0,9.6014492753623185E-2,0.17753623188405798,1.6304347826086956E-2,{"$f":"AQ61/$K$61","v":0},0,0]
[29,"Maison du combattant","8-1",989,{"$f":"'Saisie 1V'!E35:F35","v":0},524,{"$f":"D63-F63","v":465},{"$f":"'Saisie 1V'!G35","v":18},{"$f":"'Saisie 1V'!H35","v":10},{"$f":"H63+I63","v":28},{"$f":"F63-J63","v":496},{"$f":"'Saisie 1V'!I35:AM35","v":41},0,0,2,95,0,5,0,18,0,12,32,0,0,10,0,0,4,13,16,26,0,73,0,0,0,0,1,29,87,16,{"$f":"'Saisie 1V'!AN35:BR35","v":2},{"$f":"'Saisie 1V'!AO35:BS35","v":0},{"$f":"'Saisie 1V'!AP35:BT35","v":14}]
[0,0,0,0,{"$f":"E63/D63","v":0},{"$f":"IF(F63=0,\"\",F63/D63)","v":0.52982810920121337},{"$f":"IF(G63=0,\"\",G63/$D$63)","v":0.47017189079878663},{"$f":"IF(H63=0,\"\",H63/$F$63)","v":3.4351145038167941E-2},{"$f":"IF(I63=0,\"\",I63/$F$63)","v":1.9083969465648856E-2},{"$f":"IF(J63=0,\"\",J63/$F$63)","v":5.3435114503816793E-2},null,{"$f":"L63/$K$63","v":8.2661290322580641E-2},0,0,4.0322580645161289E-3,0.19153225806451613,0,1.0080645161290322E-2,0,3.6290322580645164E-2,0,2.4193548387096774E-2,6.4516129032258063E-2,0,0,2.0161290322580645E-2,0,0,8.0645161290322578E-3,2.620967741935484E-2,3.2258064516129031E-2,5.2419354838709679E-2,0,0.14717741935483872,0,0,{"$f":"AK63/$K$63","v":0},0,2.0161290322580645E-3,5.8467741935483868E-2,0.17540322580645162,3.2258064516129031E-2,{"$f":"AQ63/$K$63","v":4.0322580645161289E-3},0,2.8225806451612902E-2]
[30,"Hugo, gymnase","8-1",989,{"$f":"'Saisie 1V'!E36:F36","v":0},553,{"$f":"D65-F65","v":436},{"$f":"'Saisie 1V'!G36","v":13},{"$f":"'Saisie 1V'!H36","v":8},{"$f":"H65+I65","v":21},{"$f":"F65-J65","v":532},{"$f":"'Saisie 1V'!I36:AM36","v":26},0,0,1,152,0,2,0,10,0,4,41,0,0,17,0,0,2,22,12,20,0,72,0,0,2,0,2,52,77,11,{"$f":"'Saisie 1V'!AN36:BR36","v":1},{"$f":"'Saisie 1V'!AO36:BS36","v":0},{"$f":"'Saisie 1V'!AP36:BT36","v":6}]
[0,0,0,0,{"$f":"E65/D65","v":0},{"$f":"IF(F65=0,\"\",F65/D65)","v":0.55915065722952473},{"$f":"IF(G65=0,\"\",G65/$D$65)","v":0.44084934277047522},{"$f":"IF(H65=0,\"\",H65/$F$65)","v":2.3508137432188065E-2},{"$f":"IF(I65=0,\"\",I65/$F$65)","v":1.4466546112115732E-2},{"$f":"IF(J65=0,\"\",J65/$F$65)","v":3.7974683544303799E-2},null,{"$f":"L65/$K$65","v":4.8872180451127817E-2},0,0,1.8796992481203006E-3,0.2857142857142857,0,3.7593984962406013E-3,0,1.8796992481203006E-2,0,7.5187969924812026E-3,7.7067669172932327E-2,0,0,3.1954887218045111E-2,0,0,3.7593984962406013E-3,4.1353383458646614E-2,2.2556390977443608E-2,3.7593984962406013E-2,0,0.13533834586466165,0,0,{"$f":"AK65/$K$65","v":3.7593984962406013E-3},0,3.7593984962406013E-3,9.7744360902255634E-2,0.14473684210526316,2.0676691729323307E-2,{"$f":"AQ65/$K$65","v":1.8796992481203006E-3},0,1.1278195488721804E-2]
[31,"Salle polyvalente René Renaud","8-1",1153,{"$f":"'Saisie 1V'!E37:F37","v":0},602,{"$f":"D67-F67","v":551},{"$f":"'Saisie 1V'!G37","v":12},{"$f":"'Saisie 1V'!H37","v":4},{"$f":"H67+I67","v":16},{"$f":"F67-J67","v":586},{"$f":"'Saisie 1V'!I37:AM37","v":34},0,0,1,154,0,1,0,9,0,13,58,1,0,21,0,0,3,22,6,20,0,99,0,0,0,0,0,41,84,16,{"$f":"'Saisie 1V'!AN37:BR37","v":0},{"$f":"'Saisie 1V'!AO37:BS37","v":0},{"$f":"'Saisie 1V'!AP37:BT37","v":3}]
[0,0,0,0,{"$f":"E67/D67","v":0},{"$f":"IF(F67=0,\"\",F67/D67)","v":0.52211621856027757},{"$f":"IF(G67=0,\"\",G67/$D$67)","v":0.47788378143972249},{"$f":"IF(H67=0,\"\",H67/$F$67)","v":1.9933554817275746E-2},{"$f":"IF(I67=0,\"\",I67/$F$67)","v":6.6445182724252493E-3},{"$f":"IF(J67=0,\"\",J67/$F$67)","v":2.6578073089700997E-2},null,{"$f":"L67/$K$67","v":5.8020477815699661E-2},0,0,1.7064846416382253E-3,0.26279863481228671,0,1.7064846416382253E-3,0,1.5358361774744027E-2,0,2.2184300341296929E-2,9.8976109215017066E-2,1.7064846416382253E-3,0,3.5836177474402729E-2,0,0,5.1194539249146756E-3,3.7542662116040959E-2,1.0238907849829351E-2,3.4129692832764506E-2,0,0.16894197952218429,0,0,{"$f":"AK67/$K$67","v":0},0,0,6.9965870307167236E-2,0.14334470989761092,2.7303754266211604E-2,{"$f":"AQ67/$K$67","v":0},0,5.1194539249146756E-3]
[32,"Hugo, élémentaire","8-1",978,{"$f":"'Saisie 1V'!E38:F38","v":0},570,{"$f":"D69-F69","v":408},{"$f":"'Saisie 1V'!G38","v":5},{"$f":"'Saisie 1V'!H38","v":5},{"$f":"H69+I69","v":10},{"$f":"F69-J69","v":560},{"$f":"'Saisie 1V'!I38:AM38","v":22},0,0,1,165,0,0,0,8,0,11,44,4,0,16,1,0,0,15,5,22,0,49,0,0,0,0,2,47,132,8,{"$f":"'Saisie 1V'!AN38:BR38","v":1},{"$f":"'Saisie 1V'!AO38:BS38","v":0},{"$f":"'Saisie 1V'!AP38:BT38","v":7}]
[0,0,0,0,{"$f":"E69/D69","v":0},{"$f":"IF(F69=0,\"\",F69/D69)","v":0.58282208588957052},{"$f":"IF(G69=0,\"\",G69/$D$69)","v":0.41717791411042943},{"$f":"IF(H69=0,\"\",H69/$F$69)","v":8.771929824561403E-3},{"$f":"IF(I69=0,\"\",I69/$F$69)","v":8.771929824561403E-3},{"$f":"IF(J69=0,\"\",J69/$F$69)","v":1.7543859649122806E-2},null,{"$f":"L69/$K$69","v":3.9285714285714285E-2},0,0,1.7857142857142857E-3,0.29464285714285715,0,0,0,1.4285714285714285E-2,0,1.9642857142857142E-2,7.857142857142857E-2,7.1428571428571426E-3,0,2.8571428571428571E-2,1.7857142857142857E-3,0,0,2.6785714285714284E-2,8.9285714285714281E-3,3.9285714285714285E-2,0,8.7499999999999994E-2,0,0,{"$f":"AK69/$K$69","v":0},0,3.5714285714285713E-3,8.3928571428571422E-2,0.23571428571428571,1.4285714285714285E-2,{"$f":"AQ69/$K$69","v":1.7857142857142857E-3},0,1.2500000000000001E-2]
[33,"Camus, maternelle","8-1",1162,{"$f":"'Saisie 1V'!E39:F39","v":0},579,{"$f":"D71-F71","v":583},{"$f":"'Saisie 1V'!G39","v":14},{"$f":"'Saisie 1V'!H39","v":8},{"$f":"H71+I71","v":22},{"$f":"F71-J71","v":557},{"$f":"'Saisie 1V'!I39:AM39","v":42},0,0,2,150,0,2,0,9,0,11,42,0,0,20,0,0,1,13,7,19,0,74,0,0,0,0,0,50,92,16,{"$f":"'Saisie 1V'!AN39:BR39","v":2},{"$f":"'Saisie 1V'!AO39:BS39","v":0},{"$f":"'Saisie 1V'!AP39:BT39","v":5}]
[0,0,0,0,{"$f":"E71/D71","v":0},{"$f":"IF(F71=0,\"\",F71/D71)","v":0.49827882960413084},{"$f":"IF(G71=0,\"\",G71/$D$71)","v":0.50172117039586916},{"$f":"IF(H71=0,\"\",H71/$F$71)","v":2.4179620034542316E-2},{"$f":"IF(I71=0,\"\",I71/$F$71)","v":1.3816925734024179E-2},{"$f":"IF(J71=0,\"\",J71/$F$71)","v":3.7996545768566495E-2},null,{"$f":"L71/$K$71","v":7.5403949730700179E-2},0,0,3.5906642728904849E-3,0.26929982046678635,0,3.5906642728904849E-3,0,1.615798922800718E-2,0,1.9748653500897665E-2,7.5403949730700179E-2,0,0,3.5906642728904849E-2,0,0,1.7953321364452424E-3,2.333931777378815E-2,1.2567324955116697E-2,3.4111310592459608E-2,0,0.13285457809694792,0,0,{"$f":"AK71/$K$71","v":0},0,0,8.9766606822262118E-2,0.16517055655296231,2.8725314183123879E-2,{"$f":"AQ71/$K$71","v":3.5906642728904849E-3},0,8.9766606822262122E-3]
[34,"Guiblets","8-2",1019,{"$f":"'Saisie 1V'!E40:F40","v":0},437,{"$f":"D73-F73","v":582},{"$f":"'Saisie 1V'!G40","v":9},{"$f":"'Saisie 1V'!H40","v":14},{"$f":"H73+I73","v":23},{"$f":"F73-J73","v":414},{"$f":"'Saisie 1V'!I40:AM40","v":33},0,0,0,109,0,1,0,9,0,15,27,0,0,15,0,0,2,10,7,12,0,68,0,0,0,0,0,39,44,13,{"$f":"'Saisie 1V'!AN40:BR40","v":1},{"$f":"'Saisie 1V'!AO40:BS40","v":1},{"$f":"'Saisie 1V'!AP40:BT40","v":8}]
[0,0,0,0,{"$f":"E73/D73","v":0},{"$f":"IF(F73=0,\"\",F73/D73)","v":0.42885181550539747},{"$f":"IF(G73=0,\"\",G73/$D$73)","v":0.57114818449460258},{"$f":"IF(H73=0,\"\",H73/$F$73)","v":2.0594965675057208E-2},{"$f":"IF(I73=0,\"\",I73/$F$73)","v":3.2036613272311214E-2},{"$f":"IF(J73=0,\"\",J73/$F$73)","v":5.2631578947368418E-2},null,{"$f":"L73/$K$73","v":7.9710144927536225E-2},0,0,0,0.26328502415458938,0,2.4154589371980675E-3,0,2.1739130434782608E-2,0,3.6231884057971016E-2,6.5217391304347824E-2,0,0,3.6231884057971016E-2,0,0,4.830917874396135E-3,2.4154589371980676E-2,1.6908212560386472E-2,2.8985507246376812E-2,0,0.16425120772946861,0,0,{"$f":"AK73/$K$73","v":0},0,0,9.420289855072464E-2,0.10628019323671498,3.140096618357488E-2,{"$f":"AQ73/$K$73","v":2.4154589371980675E-3},2.4154589371980675E-3,1.932367149758454E-2]
[35,"Casalis, élémentaire","8-2",637,{"$f":"'Saisie 1V'!E41:F41","v":0},210,{"$f":"D75-F75","v":427},{"$f":"'Saisie 1V'!G41","v":5},{"$f":"'Saisie 1V'!H41","v":3},{"$f":"H75+I75","v":8},{"$f":"F75-J75","v":202},{"$f":"'Saisie 1V'!I41:AM41","v":36},0,0,0,34,0,1,0,5,0,2,15,1,0,5,0,0,0,9,5,13,0,32,0,0,0,0,2,12,20,6,{"$f":"'Saisie 1V'!AN41:BR41","v":0},{"$f":"'Saisie 1V'!AO41:BS41","v":0},{"$f":"'Saisie 1V'!AP41:BT41","v":4}]
[0,0,0,0,{"$f":"E75/D75","v":0},{"$f":"IF(F75=0,\"\",F75/D75)","v":0.32967032967032966},{"$f":"IF(G75=0,\"\",G75/$D$75)","v":0.67032967032967028},{"$f":"IF(H75=0,\"\",H75/$F$75)","v":2.3809523809523808E-2},{"$f":"IF(I75=0,\"\",I75/$F$75)","v":1.4285714285714285E-2},{"$f":"IF(J75=0,\"\",J75/$F$75)","v":3.8095238095238099E-2},null,{"$f":"L75/$K$75","v":0.17821782178217821},0,0,0,0.16831683168316833,0,4.9504950495049506E-3,0,2.4752475247524754E-2,0,9.9009900990099011E-3,7.4257425742574254E-2,4.9504950495049506E-3,0,2.4752475247524754E-2,0,0,0,4.4554455445544552E-2,2.4752475247524754E-2,6.4356435643564358E-2,0,0.15841584158415842,0,0,{"$f":"AK75/$K$75","v":0},0,9.9009900990099011E-3,5.9405940594059403E-2,9.9009900990099015E-2,2.9702970297029702E-2,{"$f":"AQ75/$K$75","v":0},0,1.9801980198019802E-2]
[36,"Guiblets","8-2",748,{"$f":"'Saisie 1V'!E42:F42","v":0},258,{"$f":"D77-F77","v":490},{"$f":"'Saisie 1V'!G42","v":6},{"$f":"'Saisie 1V'!H42","v":5},{"$f":"H77+I77","v":11},{"$f":"F77-J77","v":247},{"$f":"'Saisie 1V'!I42:AM42","v":31},0,0,0,41,0,0,0,15,0,8,14,0,0,8,0,0,2,13,4,19,0,43,0,0,0,0,1,14,26,7,{"$f":"'Saisie 1V'!AN42:BR42","v":0},{"$f":"'Saisie 1V'!AO42:BS42","v":0},{"$f":"'Saisie 1V'!AP42:BT42","v":1}]
[0,0,0,0,{"$f":"E77/D77","v":0},{"$f":"IF(F77=0,\"\",F77/D77)","v":0.34491978609625668},{"$f":"IF(G77=0,\"\",G77/$D$77)","v":0.65508021390374327},{"$f":"IF(H77=0,\"\",H77/$F$77)","v":2.3255813953488372E-2},{"$f":"IF(I77=0,\"\",I77/$F$77)","v":1.937984496124031E-2},{"$f":"IF(J77=0,\"\",J77/$F$77)","v":4.2635658914728682E-2},null,{"$f":"L77/$K$77","v":0.12550607287449392},0,0,0,0.16599190283400811,0,0,0,6.0728744939271252E-2,0,3.2388663967611336E-2,5.6680161943319839E-2,0,0,3.2388663967611336E-2,0,0,8.0971659919028341E-3,5.2631578947368418E-2,1.6194331983805668E-2,7.6923076923076927E-2,0,0.17408906882591094,0,0,{"$f":"AK77/$K$77","v":0},0,4.048582995951417E-3,5.6680161943319839E-2,0.10526315789473684,2.8340080971659919E-2,{"$f":"AQ77/$K$77","v":0},0,4.048582995951417E-3]
[37,"Casalis, maternelle","8-2",1023,{"$f":"'Saisie 1V'!E43:F43","v":0},309,{"$f":"D79-F79","v":714},{"$f":"'Saisie 1V'!G43","v":5},{"$f":"'Saisie 1V'!H43","v":7},{"$f":"H79+I79","v":12},{"$f":"F79-J79","v":297},{"$f":"'Saisie 1V'!I43:AM43","v":55},0,0,1,42,0,0,0,5,0,2,21,0,0,2,0,0,4,9,7,24,0,53,0,0,0,0,0,11,32,6,{"$f":"'Saisie 1V'!AN43:BR43","v":3},{"$f":"'Saisie 1V'!AO43:BS43","v":2},{"$f":"'Saisie 1V'!AP43:BT43","v":18}]
[0,0,0,0,{"$f":"E79/D79","v":0},{"$f":"IF(F79=0,\"\",F79/D79)","v":0.30205278592375367},{"$f":"IF(G79=0,\"\",G79/$D$79)","v":0.69794721407624638},{"$f":"IF(H79=0,\"\",H79/$F$79)","v":1.6181229773462782E-2},{"$f":"IF(I79=0,\"\",I79/$F$79)","v":2.2653721682847898E-2},{"$f":"IF(J79=0,\"\",J79/$F$79)","v":3.8834951456310676E-2},null,{"$f":"L79/$K$79","v":0.18518518518518517},0,0,3.3670033670033669E-3,0.14141414141414141,0,0,0,1.6835016835016835E-2,0,6.7340067340067337E-3,7.0707070707070704E-2,0,0,6.7340067340067337E-3,0,0,1.3468013468013467E-2,3.0303030303030304E-2,2.3569023569023569E-2,8.0808080808080815E-2,0,0.17845117845117844,0,0,{"$f":"AK79/$K$79","v":0},0,0,3.7037037037037035E-2,0.10774410774410774,2.0202020202020204E-2,{"$f":"AQ79/$K$79","v":1.0101010101010102E-2},6.7340067340067337E-3,6.0606060606060608E-2]
[38,"Jeu de paume","8-2",807,{"$f":"'Saisie 1V'!E44:F44","v":0},266,{"$f":"D81-F81","v":541},{"$f":"'Saisie 1V'!G44","v":6},{"$f":"'Saisie 1V'!H44","v":11},{"$f":"H81+I81","v":17},{"$f":"F81-J81","v":249},{"$f":"'Saisie 1V'!I44:AM44","v":38},0,0,0,45,0,1,0,1,0,4,24,0,0,7,0,0,1,16,4,21,0,39,0,0,0,0,0,11,22,6,{"$f":"'Saisie 1V'!AN44:BR44","v":2},{"$f":"'Saisie 1V'!AO44:BS44","v":2},{"$f":"'Saisie 1V'!AP44:BT44","v":5}]
[0,0,0,0,{"$f":"E81/D81","v":0},{"$f":"IF(F81=0,\"\",F81/D81)","v":0.32961586121437425},{"$f":"IF(G81=0,\"\",G81/$D$81)","v":0.67038413878562575},{"$f":"IF(H81=0,\"\",H81/$F$81)","v":2.2556390977443608E-2},{"$f":"IF(I81=0,\"\",I81/$F$81)","v":4.1353383458646614E-2},{"$f":"IF(J81=0,\"\",J81/$F$81)","v":6.3909774436090222E-2},null,{"$f":"L81/$K$81","v":0.15261044176706828},0,0,0,0.18072289156626506,0,4.0160642570281121E-3,0,4.0160642570281121E-3,0,1.6064257028112448E-2,9.6385542168674704E-2,0,0,2.8112449799196786E-2,0,0,4.0160642570281121E-3,6.4257028112449793E-2,1.6064257028112448E-2,8.4337349397590355E-2,0,0.15662650602409639,0,0,{"$f":"AK81/$K$81","v":0},0,0,4.4176706827309238E-2,8.8353413654618476E-2,2.4096385542168676E-2,{"$f":"AQ81/$K$81","v":8.0321285140562242E-3},8.0321285140562242E-3,2.0080321285140562E-2]
[39,"Jeu de paume","8-2",1178,{"$f":"'Saisie 1V'!E45:F45","v":0},466,{"$f":"D83-F83","v":712},{"$f":"'Saisie 1V'!G45","v":7},{"$f":"'Saisie 1V'!H45","v":10},{"$f":"H83+I83","v":17},{"$f":"F83-J83","v":449},{"$f":"'Saisie 1V'!I45:AM45","v":63},0,0,1,74,0,1,0,7,0,2,41,0,0,21,0,0,3,7,4,13,0,86,0,0,1,0,0,22,54,23,{"$f":"'Saisie 1V'!AN45:BR45","v":0},{"$f":"'Saisie 1V'!AO45:BS45","v":0},{"$f":"'Saisie 1V'!AP45:BT45","v":26}]
[0,0,0,0,{"$f":"E83/D83","v":0},{"$f":"IF(F83=0,\"\",F83/D83)","v":0.39558573853989815},{"$f":"IF(G83=0,\"\",G83/$D$83)","v":0.60441426146010191},{"$f":"IF(H83=0,\"\",H83/$F$83)","v":1.5021459227467811E-2},{"$f":"IF(I83=0,\"\",I83/$F$83)","v":2.1459227467811159E-2},{"$f":"IF(J83=0,\"\",J83/$F$83)","v":3.6480686695278972E-2},null,{"$f":"L83/$K$83","v":0.14031180400890869},0,0,2.2271714922048997E-3,0.16481069042316257,0,2.2271714922048997E-3,0,1.5590200445434299E-2,0,4.4543429844097994E-3,9.1314031180400893E-2,0,0,4.6770601336302897E-2,0,0,6.6815144766146995E-3,1.5590200445434299E-2,8.9086859688195987E-3,2.8953229398663696E-2,0,0.19153674832962139,0,0,{"$f":"AK83/$K$83","v":2.2271714922048997E-3},0,0,4.8997772828507792E-2,0.12026726057906459,5.1224944320712694E-2,{"$f":"AQ83/$K$83","v":0},0,5.7906458797327393E-2]
[40,"Savignat, maternelle ","8-2",929,{"$f":"'Saisie 1V'!E46:F46","v":0},273,{"$f":"D85-F85","v":656},{"$f":"'Saisie 1V'!G46","v":7},{"$f":"'Saisie 1V'!H46","v":9},{"$f":"H85+I85","v":16},{"$f":"F85-J85","v":257},{"$f":"'Saisie 1V'!I46:AM46","v":29},0,0,0,33,0,1,0,2,0,6,28,0,0,6,0,0,0,13,5,21,0,38,0,0,0,0,2,18,25,4,{"$f":"'Saisie 1V'!AN46:BR46","v":1},{"$f":"'Saisie 1V'!AO46:BS46","v":0},{"$f":"'Saisie 1V'!AP46:BT46","v":25}]
[0,0,0,0,{"$f":"E85/D85","v":0},{"$f":"IF(F85=0,\"\",F85/D85)","v":0.29386437029063511},{"$f":"IF(G85=0,\"\",G85/$D$85)","v":0.70613562970936494},{"$f":"IF(H85=0,\"\",H85/$F$85)","v":2.564102564102564E-2},{"$f":"IF(I85=0,\"\",I85/$F$85)","v":3.2967032967032968E-2},{"$f":"IF(J85=0,\"\",J85/$F$85)","v":5.8608058608058608E-2},null,{"$f":"L85/$K$85","v":0.11284046692607004},0,0,0,0.12840466926070038,0,3.8910505836575876E-3,0,7.7821011673151752E-3,0,2.3346303501945526E-2,0.10894941634241245,0,0,2.3346303501945526E-2,0,0,0,5.0583657587548639E-2,1.9455252918287938E-2,8.171206225680934E-2,0,0.14785992217898833,0,0,{"$f":"AK85/$K$85","v":0},0,7.7821011673151752E-3,7.0038910505836577E-2,9.727626459143969E-2,1.556420233463035E-2,{"$f":"AQ85/$K$85","v":3.8910505836575876E-3},0,9.727626459143969E-2]
[41,"Savignat, élémentaire","8-2",865,{"$f":"'Saisie 1V'!E47:F47","v":0},358,{"$f":"D87-F87","v":507},{"$f":"'Saisie 1V'!G47","v":10},{"$f":"'Saisie 1V'!H47","v":9},{"$f":"H87+I87","v":19},{"$f":"F87-J87","v":339},{"$f":"'Saisie 1V'!I47:AM47","v":40},0,0,1,51,0,3,0,6,0,8,28,1,0,13,0,0,0,16,6,14,0,69,0,0,0,0,0,9,44,10,{"$f":"'Saisie 1V'!AN47:BR47","v":1},{"$f":"'Saisie 1V'!AO47:BS47","v":0},{"$f":"'Saisie 1V'!AP47:BT47","v":19}]
[0,0,0,0,{"$f":"E87/D87","v":0},{"$f":"IF(F87=0,\"\",F87/D87)","v":0.41387283236994221},{"$f":"IF(G87=0,\"\",G87/$D$87)","v":0.58612716763005779},{"$f":"IF(H87=0,\"\",H87/$F$87)","v":2.7932960893854747E-2},{"$f":"IF(I87=0,\"\",I87/$F$87)","v":2.5139664804469275E-2},{"$f":"IF(J87=0,\"\",J87/$F$87)","v":5.3072625698324022E-2},null,{"$f":"L87/$K$87","v":0.11799410029498525},0,0,2.9498525073746312E-3,0.15044247787610621,0,8.8495575221238937E-3,0,1.7699115044247787E-2,0,2.359882005899705E-2,8.2595870206489674E-2,2.9498525073746312E-3,0,3.8348082595870206E-2,0,0,0,4.71976401179941E-2,1.7699115044247787E-2,4.1297935103244837E-2,0,0.20353982300884957,0,0,{"$f":"AK87/$K$87","v":0},0,0,2.6548672566371681E-2,0.12979351032448377,2.9498525073746312E-2,{"$f":"AQ87/$K$87","v":2.9498525073746312E-3},0,5.6047197640117993E-2]
[42,"La Habette, élémentaire","8-2",984,{"$f":"'Saisie 1V'!E48:F48","v":0},342,{"$f":"D89-F89","v":642},{"$f":"'Saisie 1V'!G48","v":7},{"$f":"'Saisie 1V'!H48","v":12},{"$f":"H89+I89","v":19},{"$f":"F89-J89","v":323},{"$f":"'Saisie 1V'!I48:AM48","v":59},0,0,2,40,0,3,0,15,0,7,25,0,0,13,0,0,3,17,5,15,0,68,0,0,0,0,1,3,36,4,{"$f":"'Saisie 1V'!AN48:BR48","v":0},{"$f":"'Saisie 1V'!AO48:BS48","v":0},{"$f":"'Saisie 1V'!AP48:BT48","v":7}]
[0,0,0,0,{"$f":"E89/D89","v":0},{"$f":"IF(F89=0,\"\",F89/D89)","v":0.34756097560975607},{"$f":"IF(G89=0,\"\",G89/$D$89)","v":0.65243902439024393},{"$f":"IF(H89=0,\"\",H89/$F$89)","v":2.046783625730994E-2},{"$f":"IF(I89=0,\"\",I89/$F$89)","v":3.5087719298245612E-2},{"$f":"IF(J89=0,\"\",J89/$F$89)","v":5.5555555555555552E-2},null,{"$f":"L89/$K$89","v":0.1826625386996904},0,0,6.1919504643962852E-3,0.1238390092879257,0,9.2879256965944269E-3,0,4.6439628482972138E-2,0,2.1671826625386997E-2,7.7399380804953566E-2,0,0,4.0247678018575851E-2,0,0,9.2879256965944269E-3,5.2631578947368418E-2,1.5479876160990712E-2,4.6439628482972138E-2,0,0.21052631578947367,0,0,{"$f":"AK89/$K$89","v":0},0,3.0959752321981426E-3,9.2879256965944269E-3,0.11145510835913312,1.238390092879257E-2,{"$f":"AQ89/$K$89","v":0},0,2.1671826625386997E-2]
[43,"La Habette, élémentaire","8-2",1103,{"$f":"'Saisie 1V'!E49:F49","v":0},373,{"$f":"D91-F91","v":730},{"$f":"'Saisie 1V'!G49","v":7},{"$f":"'Saisie 1V'!H49","v":6},{"$f":"H91+I91","v":13},{"$f":"F91-J91","v":360},{"$f":"'Saisie 1V'!I49:AM49","v":45},0,0,1,52,0,3,0,10,0,4,45,0,0,8,0,0,7,20,9,27,0,57,0,0,0,0,2,12,34,12,{"$f":"'Saisie 1V'!AN49:BR49","v":0},{"$f":"'Saisie 1V'!AO49:BS49","v":1},{"$f":"'Saisie 1V'!AP49:BT49","v":11}]
[0,0,0,0,{"$f":"E91/D91","v":0},{"$f":"IF(F91=0,\"\",F91/D91)","v":0.33816863100634631},{"$f":"IF(G91=0,\"\",G91/$D$91)","v":0.66183136899365369},{"$f":"IF(H91=0,\"\",H91/$F$91)","v":1.876675603217158E-2},{"$f":"IF(I91=0,\"\",I91/$F$91)","v":1.6085790884718499E-2},{"$f":"IF(J91=0,\"\",J91/$F$91)","v":3.4852546916890083E-2},null,{"$f":"L91/$K$91","v":0.125},0,0,2.7777777777777779E-3,0.14444444444444443,0,8.3333333333333332E-3,0,2.7777777777777776E-2,0,1.1111111111111112E-2,0.125,0,0,2.2222222222222223E-2,0,0,1.9444444444444445E-2,5.5555555555555552E-2,2.5000000000000001E-2,7.4999999999999997E-2,0,0.15833333333333333,0,0,{"$f":"AK91/$K$91","v":0},0,5.5555555555555558E-3,3.3333333333333333E-2,9.4444444444444442E-2,3.3333333333333333E-2,{"$f":"AQ91/$K$91","v":0},2.7777777777777779E-3,3.0555555555555555E-2]
[44,"Centre socio-culturel M.Rebérioux","8-2",926,{"$f":"'Saisie 1V'!E50:F50","v":0},369,{"$f":"D93-F93","v":557},{"$f":"'Saisie 1V'!G50","v":13},{"$f":"'Saisie 1V'!H50","v":5},{"$f":"H93+I93","v":18},{"$f":"F93-J93","v":351},{"$f":"'Saisie 1V'!I50:AM50","v":41},0,0,4,57,0,2,0,7,0,3,39,0,0,4,0,0,3,11,12,17,0,46,0,0,1,0,2,15,51,9,{"$f":"'Saisie 1V'!AN50:BR50","v":0},{"$f":"'Saisie 1V'!AO50:BS50","v":2},{"$f":"'Saisie 1V'!AP50:BT50","v":25}]
[0,0,0,0,{"$f":"E93/$D$93","v":0},{"$f":"IF(F93=0,\"\",F93/D93)","v":0.39848812095032399},{"$f":"IF(G93=0,\"\",G93/$D$93)","v":0.60151187904967607},{"$f":"IF(H93=0,\"\",H93/$F$93)","v":3.5230352303523033E-2},{"$f":"IF(I93=0,\"\",I93/$F$93)","v":1.3550135501355014E-2},{"$f":"IF(J93=0,\"\",J93/$F$93)","v":4.878048780487805E-2},null,{"$f":"L93/$K$93","v":0.11680911680911681},0,0,1.1396011396011397E-2,0.1623931623931624,0,5.6980056980056983E-3,0,1.9943019943019943E-2,0,8.5470085470085479E-3,0.1111111111111111,0,0,1.1396011396011397E-2,0,0,8.5470085470085479E-3,3.1339031339031341E-2,3.4188034188034191E-2,4.843304843304843E-2,0,0.13105413105413105,0,0,{"$f":"AK93/$K$93","v":2.8490028490028491E-3},0,5.6980056980056983E-3,4.2735042735042736E-2,0.14529914529914531,2.564102564102564E-2,{"$f":"AQ93/$K$93","v":0},5.6980056980056983E-3,7.1225071225071226E-2]
[45,"Les Sarrazins, élémentaire","8-2",1369,{"$f":"'Saisie 1V'!E51:F51","v":0},544,{"$f":"D95-F95","v":825},{"$f":"'Saisie 1V'!G51","v":16},{"$f":"'Saisie 1V'!H51","v":7},{"$f":"H95+I95","v":23},{"$f":"F95-J95","v":521},{"$f":"'Saisie 1V'!I51:AM51","v":64},0,0,1,116,0,3,0,11,0,11,46,1,0,5,0,0,5,21,10,45,0,62,0,0,0,0,2,12,79,8,{"$f":"'Saisie 1V'!AN51:BR51","v":2},{"$f":"'Saisie 1V'!AO51:BS51","v":2},{"$f":"'Saisie 1V'!AP51:BT51","v":15}]
[0,0,0,0,{"$f":"E95/$D$95","v":0},{"$f":"IF(F95=0,\"\",F95/D95)","v":0.39737034331628929},{"$f":"IF(G95=0,\"\",G95/$D$95)","v":0.60262965668371071},{"$f":"IF(H95=0,\"\",H95/$F$95)","v":2.9411764705882353E-2},{"$f":"IF(I95=0,\"\",I95/$F$95)","v":1.2867647058823529E-2},{"$f":"IF(J95=0,\"\",J95/$F$95)","v":4.2279411764705885E-2},null,{"$f":"L95/$K$95","v":0.12284069097888675},0,0,1.9193857965451055E-3,0.22264875239923224,0,5.7581573896353169E-3,0,2.1113243761996161E-2,0,2.1113243761996161E-2,8.829174664107485E-2,1.9193857965451055E-3,0,9.5969289827255271E-3,0,0,9.5969289827255271E-3,4.0307101727447218E-2,1.9193857965451054E-2,8.6372360844529747E-2,0,0.11900191938579655,0,0,{"$f":"AK95/$K$95","v":0},0,3.838771593090211E-3,2.3032629558541268E-2,0.15163147792706333,1.5355086372360844E-2,{"$f":"AQ95/$K$95","v":3.838771593090211E-3},3.838771593090211E-3,2.8790786948176585E-2]
[46,0,0,0,{"$f":"'Saisie 1V'!E52:F52","v":0},0,{"$f":"D97-F97","v":0},{"$f":"'Saisie 1V'!G52","v":0},{"$f":"'Saisie 1V'!H52","v":0},{"$f":"H97+I97","v":0},{"$f":"F97-J97","v":0},{"$f":"'Saisie 1V'!I52:AM52","v":0},0,0,100,0,0,0,100,0,0,0,0,0,0,0,0,0,0,0,0,0,0,0,0,0,0,0,0,0,0,0,{"$f":"'Saisie 1V'!AN52:BR52","v":0},{"$f":"'Saisie 1V'!AO52:BS52","v":0},{"$f":"'Saisie 1V'!AP52:BT52","v":0}]
[0,0,0,0,{"$f":"E97/$D$97","v":{"$error":"#DIV/0!"}},{"$f":"IF(F97=0,\"\",F97/D97)","v":""},{"$f":"IF(G97=0,\"\",G97/$D$97)","v":""},{"$f":"IF(H97=0,\"\",H97/$F$97)","v":""},{"$f":"IF(I97=0,\"\",I97/$F$97)","v":""},{"$f":"IF(J97=0,\"\",J97/$F$97)","v":""},null,{"$f":"L97/$K$97","v":{"$error":"#DIV/0!"}},{"$error":"#DIV/0!"},{"$error":"#DIV/0!"},{"$error":"#DIV/0!"},{"$error":"#DIV/0!"},{"$error":"#DIV/0!"},{"$error":"#DIV/0!"},{"$error":"#DIV/0!"},{"$error":"#DIV/0!"},{"$error":"#DIV/0!"},{"$error":"#DIV/0!"},{"$error":"#DIV/0!"},{"$error":"#DIV/0!"},{"$error":"#DIV/0!"},{"$error":"#DIV/0!"},{"$error":"#DIV/0!"},{"$error":"#DIV/0!"},{"$error":"#DIV/0!"},{"$error":"#DIV/0!"},{"$error":"#DIV/0!"},{"$error":"#DIV/0!"},{"$error":"#DIV/0!"},{"$error":"#DIV/0!"},{"$error":"#DIV/0!"},{"$error":"#DIV/0!"},{"$f":"AK97/$K$97","v":{"$error":"#DIV/0!"}},{"$error":"#DIV/0!"},{"$error":"#DIV/0!"},{"$error":"#DIV/0!"},{"$error":"#DIV/0!"},{"$error":"#DIV/0!"},{"$f":"AQ97/$K$97","v":{"$error":"#DIV/0!"}},{"$error":"#DIV/0!"},{"$error":"#DIV/0!"}]
[47,0,0,0,{"$f":"'Saisie 1V'!E53:F53","v":0},0,{"$f":"D99-F99","v":0},{"$f":"'Saisie 1V'!G53","v":0},{"$f":"'Saisie 1V'!H53","v":0},{"$f":"H99+I99","v":0},{"$f":"F99-J99","v":0},{"$f":"'Saisie 1V'!I53:AM53","v":0},0,0,100,0,0,0,100,0,0,0,0,0,0,0,0,0,0,0,0,0,0,0,0,0,0,0,0,0,0,0,{"$f":"'Saisie 1V'!AN53:BR53","v":0},{"$f":"'Saisie 1V'!AO53:BS53","v":0},{"$f":"'Saisie 1V'!AP53:BT53","v":0}]
[0,0,0,0,{"$f":"E99/$D$99","v":{"$error":"#DIV/0!"}},{"$f":"IF(F99=0,\"\",F99/D99)","v":""},{"$f":"IF(G99=0,\"\",G99/$D$99)","v":""},{"$f":"IF(H99=0,\"\",H99/$F$99)","v":""},{"$f":"IF(I99=0,\"\",I99/$F$99)","v":""},{"$f":"IF(J99=0,\"\",J99/$F$99)","v":""},null,{"$f":"L99/$K$99","v":{"$error":"#DIV/0!"}},{"$error":"#DIV/0!"},{"$error":"#DIV/0!"},{"$error":"#DIV/0!"},{"$error":"#DIV/0!"},{"$error":"#DIV/0!"},{"$error":"#DIV/0!"},{"$error":"#DIV/0!"},{"$error":"#DIV/0!"},{"$error":"#DIV/0!"},{"$error":"#DIV/0!"},{"$error":"#DIV/0!"},{"$error":"#DIV/0!"},{"$error":"#DIV/0!"},{"$error":"#DIV/0!"},{"$error":"#DIV/0!"},{"$error":"#DIV/0!"},{"$error":"#DIV/0!"},{"$error":"#DIV/0!"},{"$error":"#DIV/0!"},{"$error":"#DIV/0!"},{"$error":"#DIV/0!"},{"$error":"#DIV/0!"},{"$error":"#DIV/0!"},{"$error":"#DIV/0!"},{"$f":"AK99/$K$99","v":{"$error":"#DIV/0!"}},{"$error":"#DIV/0!"},{"$error":"#DIV/0!"},{"$error":"#DIV/0!"},{"$error":"#DIV/0!"},{"$error":"#DIV/0!"},{"$f":"AQ99/$K$99","v":{"$error":"#DIV/0!"}},{"$error":"#DIV/0!"},{"$error":"#DIV/0!"}]
[48,0,0,0,{"$f":"'Saisie 1V'!E54:F54","v":0},0,{"$f":"D101-F101","v":0},{"$f":"'Saisie 1V'!G54","v":0},{"$f":"'Saisie 1V'!H54","v":0},{"$f":"H101+I101","v":0},{"$f":"F101-J101","v":0},{"$f":"'Saisie 1V'!I54:AM54","v":0},0,0,0,0,0,0,100,0,0,0,0,0,0,0,0,0,0,0,0,0,0,0,0,0,0,0,0,0,0,0,{"$f":"'Saisie 1V'!AN54:BR54","v":0},{"$f":"'Saisie 1V'!AO54:BS54","v":0},{"$f":"'Saisie 1V'!AP54:BT54","v":0},null,null,"CRETEIL critères par canton"]
[0,0,0,0,{"$f":"E101/$D$101","v":{"$error":"#DIV/0!"}},{"$f":"IF(F101=0,\"\",F101/D101)","v":""},{"$f":"IF(G101=0,\"\",G101/$D$101)","v":""},{"$f":"IF(H101=0,\"\",H101/$F$101)","v":""},{"$f":"IF(I101=0,\"\",I101/$F$101)","v":""},{"$f":"IF(J101=0,\"\",J101/$F$101)","v":""},null,{"$f":"L101/$K$101","v":{"$error":"#DIV/0!"}},{"$error":"#DIV/0!"},{"$error":"#DIV/0!"},{"$error":"#DIV/0!"},{"$error":"#DIV/0!"},{"$error":"#DIV/0!"},{"$error":"#DIV/0!"},{"$error":"#DIV/0!"},{"$error":"#DIV/0!"},{"$error":"#DIV/0!"},{"$error":"#DIV/0!"},{"$error":"#DIV/0!"},{"$error":"#DIV/0!"},{"$error":"#DIV/0!"},{"$error":"#DIV/0!"},{"$error":"#DIV/0!"},{"$error":"#DIV/0!"},{"$error":"#DIV/0!"},{"$error":"#DIV/0!"},{"$error":"#DIV/0!"},{"$error":"#DIV/0!"},{"$error":"#DIV/0!"},{"$error":"#DIV/0!"},{"$error":"#DIV/0!"},{"$error":"#DIV/0!"},{"$f":"AK101/$K$101","v":{"$error":"#DIV/0!"}},{"$error":"#DIV/0!"},{"$error":"#DIV/0!"},{"$error":"#DIV/0!"},{"$error":"#DIV/0!"},{"$error":"#DIV/0!"},{"$f":"AQ101/$K$101","v":{"$error":"#DIV/0!"}},{"$error":"#DIV/0!"},{"$error":"#DIV/0!"},null,null,"CR",null,"CR_7","CR_8"]
[49,0,0,0,{"$f":"'Saisie 1V'!E55:F556","v":0},0,{"$f":"D103-F103","v":0},{"$f":"'Saisie 1V'!G55","v":0},{"$f":"'Saisie 1V'!H55","v":0},{"$f":"H103+I103","v":0},{"$f":"F103-J103","v":0},{"$f":"'Saisie 1V'!I55:AM55","v":0},0,0,0,0,0,100,0,0,0,0,0,0,0,0,0,0,0,0,0,0,0,0,0,0,0,0,0,0,0,0,{"$f":"'Saisie 1V'!AN55:BR55","v":0},{"$f":"'Saisie 1V'!AO55:BS55","v":0},{"$f":"'Saisie 1V'!AP55:BT55","v":0},null,null,"CAN",null,"CAN","CAN"]
[0,0,0,0,{"$f":"E103/$D$103","v":{"$error":"#DIV/0!"}},{"$f":"IF(F103=0,\"\",F103/D103)","v":""},{"$f":"IF(G103=0,\"\",G103/$D$103)","v":""},{"$f":"IF(H103=0,\"\",H103/$F$103)","v":""},{"$f":"IF(I103=0,\"\",I103/$F$103)","v":""},{"$f":"IF(J103=0,\"\",J103/$F$103)","v":""},null,{"$f":"L103/$K$103","v":{"$error":"#DIV/0!"}},{"$error":"#DIV/0!"},{"$error":"#DIV/0!"},{"$error":"#DIV/0!"},{"$error":"#DIV/0!"},{"$error":"#DIV/0!"},{"$error":"#DIV/0!"},{"$error":"#DIV/0!"},{"$error":"#DIV/0!"},{"$error":"#DIV/0!"},{"$error":"#DIV/0!"},{"$error":"#DIV/0!"},{"$error":"#DIV/0!"},{"$error":"#DIV/0!"},{"$error":"#DIV/0!"},{"$error":"#DIV/0!"},{"$error":"#DIV/0!"},{"$error":"#DIV/0!"},{"$error":"#DIV/0!"},{"$error":"#DIV/0!"},{"$error":"#DIV/0!"},{"$error":"#DIV/0!"},{"$error":"#DIV/0!"},{"$error":"#DIV/0!"},{"$error":"#DIV/0!"},{"$f":"AK103/$K$103","v":{"$error":"#DIV/0!"}},{"$error":"#DIV/0!"},{"$error":"#DIV/0!"},{"$error":"#DIV/0!"},{"$error":"#DIV/0!"},{"$error":"#DIV/0!"},{"$f":"AQ103/$K$103","v":{"$error":"#DIV/0!"}},{"$error":"#DIV/0!"},{"$error":"#DIV/0!"},null,null,"7*",null,"7*","8*"]
[50,0,0,0,{"$f":"'Saisie 1V'!E56:F56","v":0},0,{"$f":"D105-F105","v":0},{"$f":"'Saisie 1V'!G56","v":0},{"$f":"'Saisie 1V'!H56","v":0},{"$f":"H105+I105","v":0},{"$f":"F105-J105","v":0},{"$f":"'Saisie 1V'!I56:AM56","v":0},0,0,0,0,0,100,0,0,0,0,0,0,0,0,0,0,0,0,0,0,0,0,0,0,0,0,0,0,0,0,{"$f":"'Saisie 1V'!AN56:BR56","v":0},{"$f":"'Saisie 1V'!AO56:BS56","v":0},{"$f":"'Saisie 1V'!AP56:BT56","v":0},null,null,"8*"]
[0,0,0,0,{"$f":"E105/$D$105","v":{"$error":"#DIV/0!"}},{"$f":"IF(F105=0,\"\",F105/D105)","v":""},{"$f":"IF(G105=0,\"\",G105/D105)","v":""},{"$f":"IF(H105=0,\"\",H105/$F$105)","v":""},{"$f":"IF(I105=0,\"\",I105/$F$105)","v":""},{"$f":"IF(J105=0,\"\",J105/$F$105)","v":""},null,{"$f":"L105/$K105","v":{"$error":"#DIV/0!"}},{"$f":"M105/$K$105","v":{"$error":"#DIV/0!"}},{"$error":"#DIV/0!"},{"$error":"#DIV/0!"},{"$error":"#DIV/0!"},{"$error":"#DIV/0!"},{"$error":"#DIV/0!"},{"$error":"#DIV/0!"},{"$error":"#DIV/0!"},{"$error":"#DIV/0!"},{"$error":"#DIV/0!"},{"$error":"#DIV/0!"},{"$error":"#DIV/0!"},{"$error":"#DIV/0!"},{"$error":"#DIV/0!"},{"$error":"#DIV/0!"},{"$error":"#DIV/0!"},{"$error":"#DIV/0!"},{"$error":"#DIV/0!"},{"$error":"#DIV/0!"},{"$error":"#DIV/0!"},{"$error":"#DIV/0!"},{"$error":"#DIV/0!"},{"$error":"#DIV/0!"},{"$error":"#DIV/0!"},{"$f":"AK105/$K$105","v":{"$error":"#DIV/0!"}},{"$error":"#DIV/0!"},{"$error":"#DIV/0!"},{"$error":"#DIV/0!"},{"$error":"#DIV/0!"},{"$error":"#DIV/0!"},{"$f":"AQ105/$K$105","v":{"$error":"#DIV/0!"}},{"$error":"#DIV/0!"},{"$error":"#DIV/0!"}]
[]
[]
[{"$f":"GE!$A$135:$D$148","v":0},"Canton de Bonneuil","bo",0,{"$f":"'Saisie 1V'!E59:F59","v":0},0,{"$f":"D109-F109","v":0},{"$f":"'Saisie 1V'!G59","v":0},{"$f":"'Saisie 1V'!H59","v":0},{"$f":"H109+I109","v":0},{"$f":"F109-J109","v":0},{"$f":"'Saisie 1V'!I59:AM59","v":0},0,0,0,0,0,100,0,0,0,0,0,0,0,0,0,0,0,0,0,0,0,0,0,0,0,0,0,0,0,0,{"$f":"'Saisie 1V'!AN59:BR59","v":0},{"$f":"'Saisie 1V'!AO59:BS59","v":0},{"$f":"'Saisie 1V'!AP59:BT59","v":0}]
[0,0,0,0,{"$f":"E109/$D$111","v":{"$error":"#DIV/0!"}},{"$f":"IF(F109=0,\"\",F109/D109)","v":""},{"$f":"IF(G109=0,\"\",G109/$D$109)","v":""},{"$f":"IF(H109=0,\"\",H109/$F$109)","v":""},{"$f":"IF(I109=0,\"\",I109/$F$109)","v":""},{"$f":"IF(J109=0,\"\",J109/$F$109)","v":""},null,{"$f":"L109/$K$109","v":{"$error":"#DIV/0!"}},{"$f":"M109/$K$111","v":{"$error":"#DIV/0!"}},{"$error":"#DIV/0!"},{"$error":"#DIV/0!"},{"$error":"#DIV/0!"},{"$error":"#DIV/0!"},{"$error":"#DIV/0!"},{"$error":"#DIV/0!"},{"$error":"#DIV/0!"},{"$error":"#DIV/0!"},{"$error":"#DIV/0!"},{"$error":"#DIV/0!"},{"$error":"#DIV/0!"},{"$error":"#DIV/0!"},{"$error":"#DIV/0!"},{"$error":"#DIV/0!"},{"$error":"#DIV/0!"},{"$error":"#DIV/0!"},{"$error":"#DIV/0!"},{"$error":"#DIV/0!"},{"$error":"#DIV/0!"},{"$error":"#DIV/0!"},{"$error":"#DIV/0!"},{"$error":"#DIV/0!"},{"$error":"#DIV/0!"},{"$error":"#DIV/0!"},{"$error":"#DIV/0!"},{"$error":"#DIV/0!"},{"$error":"#DIV/0!"},{"$f":"AO109/$K$109","v":{"$error":"#DIV/0!"}},{"$f":"AP109/$K$109","v":{"$error":"#DIV/0!"}},{"$f":"AQ109/$K$109","v":{"$error":"#DIV/0!"}},{"$error":"#DIV/0!"},{"$error":"#DIV/0!"}]
[0,"Canton de Champigny ouest","ch-o",0,{"$f":"'Saisie 1V'!E60:F60","v":0},0,{"$f":"D111-F111","v":0},{"$f":"'Saisie 1V'!G60","v":0},{"$f":"'Saisie 1V'!H60","v":0},{"$f":"H111+I111","v":0},{"$f":"F111-J111","v":0},{"$f":"'Saisie 1V'!I60:AM60","v":0},0,0,0,0,0,100,0,0,0,0,0,0,0,0,0,0,0,0,0,0,0,0,0,0,0,0,0,0,0,0,{"$f":"'Saisie 1V'!AN60:BR60","v":0},{"$f":"'Saisie 1V'!AO60:BS60","v":0},{"$f":"'Saisie 1V'!AP60:BT60","v":0}]
[0,0,0,0,{"$f":"E111/$D$111","v":{"$error":"#DIV/0!"}},{"$f":"IF(F111=0,\"\",F111/D111)","v":""},{"$f":"IF(G111=0,\"\",G111/$D$111)","v":""},{"$f":"IF(H111=0,\"\",H111/$F$111)","v":""},{"$f":"IF(I111=0,\"\",I111/$F$111)","v":""},{"$f":"IF(J111=0,\"\",J111/$F$111)","v":""},null,{"$f":"L111/$K$111","v":{"$error":"#DIV/0!"}},{"$error":"#DIV/0!"},{"$error":"#DIV/0!"},{"$error":"#DIV/0!"},{"$error":"#DIV/0!"},{"$error":"#DIV/0!"},{"$error":"#DIV/0!"},{"$error":"#DIV/0!"},{"$error":"#DIV/0!"},{"$error":"#DIV/0!"},{"$error":"#DIV/0!"},{"$error":"#DIV/0!"},{"$error":"#DIV/0!"},{"$error":"#DIV/0!"},{"$error":"#DIV/0!"},{"$error":"#DIV/0!"},{"$error":"#DIV/0!"},{"$error":"#DIV/0!"},{"$error":"#DIV/0!"},{"$error":"#DIV/0!"},{"$error":"#DIV/0!"},{"$error":"#DIV/0!"},{"$error":"#DIV/0!"},{"$error":"#DIV/0!"},{"$error":"#DIV/0!"},{"$error":"#DIV/0!"},{"$error":"#DIV/0!"},{"$error":"#DIV/0!"},{"$error":"#DIV/0!"},{"$error":"#DIV/0!"},{"$error":"#DIV/0!"},{"$f":"AQ111/$K$111","v":{"$error":"#DIV/0!"}},{"$error":"#DIV/0!"},{"$error":"#DIV/0!"}]
[0,"Canton de Saint-Maur centre","sm-c",0,{"$f":"'Saisie 1V'!E61:F61","v":0},0,{"$f":"D113-F113","v":0},{"$f":"'Saisie 1V'!G61","v":0},{"$f":"'Saisie 1V'!H61","v":0},{"$f":"H113+I113","v":0},{"$f":"F113-J113","v":0},{"$f":"'Saisie 1V'!I61:AM61","v":0},0,0,0,0,0,100,0,0,0,0,0,0,0,0,0,0,0,0,0,0,0,0,0,0,0,0,0,0,0,0,{"$f":"'Saisie 1V'!AN61:BR61","v":0},{"$f":"'Saisie 1V'!AO61:BS61","v":0},{"$f":"'Saisie 1V'!AP61:BT61","v":0}]
[0,0,0,0,{"$f":"E113/$D$113","v":{"$error":"#DIV/0!"}},{"$f":"IF(F113=0,\"\",F113/D113)","v":""},{"$f":"IF(G113=0,\"\",G113/$D$113)","v":""},{"$f":"IF(H113=0,\"\",H113/$F$113)","v":""},{"$f":"IF(I113=0,\"\",I113/$F$113)","v":""},{"$f":"IF(J113=0,\"\",J113/$F$113)","v":""},null,{"$f":"L113/$K$113","v":{"$error":"#DIV/0!"}},{"$error":"#DIV/0!"},{"$error":"#DIV/0!"},{"$error":"#DIV/0!"},{"$error":"#DIV/0!"},{"$error":"#DIV/0!"},{"$error":"#DIV/0!"},{"$error":"#DIV/0!"},{"$error":"#DIV/0!"},{"$error":"#DIV/0!"},{"$error":"#DIV/0!"},{"$error":"#DIV/0!"},{"$error":"#DIV/0!"},{"$error":"#DIV/0!"},{"$error":"#DIV/0!"},{"$error":"#DIV/0!"},{"$error":"#DIV/0!"},{"$error":"#DIV/0!"},{"$error":"#DIV/0!"},{"$error":"#DIV/0!"},{"$error":"#DIV/0!"},{"$error":"#DIV/0!"},{"$error":"#DIV/0!"},{"$error":"#DIV/0!"},{"$error":"#DIV/0!"},{"$error":"#DIV/0!"},{"$error":"#DIV/0!"},{"$error":"#DIV/0!"},{"$error":"#DIV/0!"},{"$error":"#DIV/0!"},{"$error":"#DIV/0!"},{"$f":"AQ113/$K$113","v":{"$error":"#DIV/0!"}},{"$error":"#DIV/0!"},{"$error":"#DIV/0!"}]
[0,"Canton de Saint-Maur ouest","sm-o",0,{"$f":"'Saisie 1V'!E62:F62","v":0},0,{"$f":"D115-F115","v":0},{"$f":"'Saisie 1V'!G62","v":0},{"$f":"'Saisie 1V'!H62","v":0},{"$f":"H115+I115","v":0},{"$f":"F115-J115","v":0},{"$f":"'Saisie 1V'!I62:AM62","v":0},0,0,0,0,0,100,0,0,0,0,0,0,0,0,0,0,0,0,0,0,0,0,0,0,0,0,0,0,0,0,{"$f":"'Saisie 1V'!AN62:BR62","v":0},{"$f":"'Saisie 1V'!AO62:BS62","v":0},{"$f":"'Saisie 1V'!AP62:BT62","v":0}]
[0,0,0,0,{"$f":"E115/$D$115","v":{"$error":"#DIV/0!"}},{"$f":"IF(F115=0,\"\",F115/D115)","v":""},{"$f":"IF(G115=0,\"\",G115/$D$115)","v":""},{"$f":"IF(H115=0,\"\",H115/$F$115)","v":""},{"$f":"IF(I115=0,\"\",I115/$F$115)","v":""},{"$f":"IF(J115=0,\"\",J115/$F$115)","v":""},null,{"$f":"L115/$K$115","v":{"$error":"#DIV/0!"}},{"$error":"#DIV/0!"},{"$error":"#DIV/0!"},{"$error":"#DIV/0!"},{"$error":"#DIV/0!"},{"$error":"#DIV/0!"},{"$error":"#DIV/0!"},{"$error":"#DIV/0!"},{"$error":"#DIV/0!"},{"$error":"#DIV/0!"},{"$error":"#DIV/0!"},{"$error":"#DIV/0!"},{"$error":"#DIV/0!"},{"$error":"#DIV/0!"},{"$error":"#DIV/0!"},{"$error":"#DIV/0!"},{"$error":"#DIV/0!"},{"$error":"#DIV/0!"},{"$error":"#DIV/0!"},{"$error":"#DIV/0!"},{"$error":"#DIV/0!"},{"$error":"#DIV/0!"},{"$error":"#DIV/0!"},{"$error":"#DIV/0!"},{"$error":"#DIV/0!"},{"$error":"#DIV/0!"},{"$error":"#DIV/0!"},{"$error":"#DIV/0!"},{"$error":"#DIV/0!"},{"$error":"#DIV/0!"},{"$error":"#DIV/0!"},{"$f":"AQ115/$K$115","v":{"$error":"#DIV/0!"}},{"$error":"#DIV/0!"},{"$error":"#DIV/0!"}]
[0,"Canton de Saint-Maur-La Varenne","sm-v",0,{"$f":"'Saisie 1V'!E63:F63","v":0},0,{"$f":"D117-F117","v":0},{"$f":"'Saisie 1V'!G63","v":0},{"$f":"'Saisie 1V'!H63","v":0},{"$f":"H117+I117","v":0},{"$f":"F117-J117","v":0},{"$f":"'Saisie 1V'!I63:AM63","v":0},0,0,0,0,0,100,0,0,0,0,0,0,0,0,0,0,0,0,0,0,0,0,0,0,0,0,0,0,0,0,{"$f":"'Saisie 1V'!AN63:BR63","v":0},{"$f":"'Saisie 1V'!AO63:BS63","v":0},{"$f":"'Saisie 1V'!AP63:BT63","v":0}]
[0,0,0,0,{"$f":"E117/$D$117","v":{"$error":"#DIV/0!"}},{"$f":"IF(F117=0,\"\",F117/D117)","v":""},{"$f":"IF(G117=0,\"\",G117/$D$117)","v":""},{"$f":"IF(H117=0,\"\",H117/$F$117)","v":""},{"$f":"IF(I117=0,\"\",I117/$F$117)","v":""},{"$f":"IF(J117=0,\"\",J117/$F$117)","v":""},null,{"$f":"L117/$K$117","v":{"$error":"#DIV/0!"}},{"$error":"#DIV/0!"},{"$error":"#DIV/0!"},{"$error":"#DIV/0!"},{"$error":"#DIV/0!"},{"$error":"#DIV/0!"},{"$error":"#DIV/0!"},{"$error":"#DIV/0!"},{"$error":"#DIV/0!"},{"$error":"#DIV/0!"},{"$error":"#DIV/0!"},{"$error":"#DIV/0!"},{"$error":"#DIV/0!"},{"$error":"#DIV/0!"},{"$error":"#DIV/0!"},{"$error":"#DIV/0!"},{"$error":"#DIV/0!"},{"$error":"#DIV/0!"},{"$error":"#DIV/0!"},{"$error":"#DIV/0!"},{"$error":"#DIV/0!"},{"$error":"#DIV/0!"},{"$error":"#DIV/0!"},{"$error":"#DIV/0!"},{"$error":"#DIV/0!"},{"$error":"#DIV/0!"},{"$error":"#DIV/0!"},{"$error":"#DIV/0!"},{"$error":"#DIV/0!"},{"$error":"#DIV/0!"},{"$error":"#DIV/0!"},{"$f":"AQ117/$K$117","v":{"$error":"#DIV/0!"}},{"$error":"#DIV/0!"},{"$error":"#DIV/0!"}]
[0,"y",0,0,{"$f":"'Saisie 1V'!E64:F64","v":0},0,{"$f":"D119-F119","v":0},{"$f":"'Saisie 1V'!G64","v":0},{"$f":"'Saisie 1V'!H64","v":0},{"$f":"H119+I119","v":0},{"$f":"F119-J119","v":0},{"$f":"'Saisie 1V'!I64:AM64","v":0},0,0,0,0,0,100,0,0,0,0,0,0,0,0,0,0,0,0,0,0,0,0,0,0,0,0,0,0,0,0,{"$f":"'Saisie 1V'!AN64:BR64","v":0},{"$f":"'Saisie 1V'!AO64:BS64","v":0},{"$f":"'Saisie 1V'!AP64:BT64","v":0}]
[0,0,0,0,{"$f":"E119/$D$119","v":{"$error":"#DIV/0!"}},{"$f":"IF(F119=0,\"\",F119/D119)","v":""},{"$f":"IF(G119=0,\"\",G119/$D$119)","v":""},{"$f":"IF(H119=0,\"\",H119/$F$119)","v":""},{"$f":"IF(I119=0,\"\",I119/$F$119)","v":""},{"$f":"IF(J119=0,\"\",J119/$F$119)","v":""},null,{"$f":"L119/$K$119","v":{"$error":"#DIV/0!"}},{"$error":"#DIV/0!"},{"$error":"#DIV/0!"},{"$error":"#DIV/0!"},{"$error":"#DIV/0!"},{"$error":"#DIV/0!"},{"$error":"#DIV/0!"},{"$error":"#DIV/0!"},{"$error":"#DIV/0!"},{"$error":"#DIV/0!"},{"$error":"#DIV/0!"},{"$error":"#DIV/0!"},{"$error":"#DIV/0!"},{"$error":"#DIV/0!"},{"$error":"#DIV/0!"},{"$error":"#DIV/0!"},{"$error":"#DIV/0!"},{"$error":"#DIV/0!"},{"$error":"#DIV/0!"},{"$error":"#DIV/0!"},{"$error":"#DIV/0!"},{"$error":"#DIV/0!"},{"$error":"#DIV/0!"},{"$error":"#DIV/0!"},{"$error":"#DIV/0!"},{"$error":"#DIV/0!"},{"$error":"#DIV/0!"},{"$error":"#DIV/0!"},{"$error":"#DIV/0!"},{"$error":"#DIV/0!"},{"$error":"#DIV/0!"},{"$f":"AQ119/$K$119","v":{"$error":"#DIV/0!"}},{"$error":"#DIV/0!"},{"$error":"#DIV/0!"}]
[0,"z",0,0,{"$f":"'Saisie 1V'!E65:F65","v":0},0,{"$f":"D121-F121","v":0},{"$f":"'Saisie 1V'!G65","v":0},{"$f":"'Saisie 1V'!H65","v":0},{"$f":"H121+I121","v":0},{"$f":"F121-J121","v":0},{"$f":"'Saisie 1V'!I65:AM65","v":0},0,0,0,0,0,100,0,0,0,0,0,0,0,0,0,0,0,0,0,0,0,0,0,0,0,0,0,0,0,0,{"$f":"'Saisie 1V'!AN65:BR65","v":0},{"$f":"'Saisie 1V'!AO65:BS65","v":0},{"$f":"'Saisie 1V'!AP65:BT65","v":0}]
[0,0,0,0,{"$f":"E121/$D$121","v":{"$error":"#DIV/0!"}},{"$f":"IF(F121=0,\"\",F121/D121)","v":""},{"$f":"IF(G121=0,\"\",G121/$D$121)","v":""},{"$f":"IF(H121=0,\"\",H121/$F$121)","v":""},{"$f":"IF(I121=0,\"\",I121/$F$121)","v":""},{"$f":"IF(J121=0,\"\",J121/$F$121)","v":""},null,{"$f":"L121/$K$121","v":{"$error":"#DIV/0!"}},{"$error":"#DIV/0!"},{"$error":"#DIV/0!"},{"$error":"#DIV/0!"},{"$error":"#DIV/0!"},{"$error":"#DIV/0!"},{"$error":"#DIV/0!"},{"$error":"#DIV/0!"},{"$error":"#DIV/0!"},{"$error":"#DIV/0!"},{"$error":"#DIV/0!"},{"$error":"#DIV/0!"},{"$error":"#DIV/0!"},{"$error":"#DIV/0!"},{"$error":"#DIV/0!"},{"$error":"#DIV/0!"},{"$error":"#DIV/0!"},{"$error":"#DIV/0!"},{"$error":"#DIV/0!"},{"$error":"#DIV/0!"},{"$error":"#DIV/0!"},{"$error":"#DIV/0!"},{"$error":"#DIV/0!"},{"$error":"#DIV/0!"},{"$error":"#DIV/0!"},{"$error":"#DIV/0!"},{"$error":"#DIV/0!"},{"$error":"#DIV/0!"},{"$error":"#DIV/0!"},{"$error":"#DIV/0!"},{"$error":"#DIV/0!"},{"$f":"AQ121/$K$121","v":{"$error":"#DIV/0!"}},{"$error":"#DIV/0!"},{"$error":"#DIV/0!"}]
[]
[]
[]
[{"$f":"GE!$A$149:$D$162","v":0},"Canton de Choisy-le-roi","clr",0,{"$f":"'Saisie 1V'!E69:F69","v":0},0,{"$f":"D126-F126","v":0},{"$f":"'Saisie 1V'!G69","v":0},{"$f":"'Saisie 1V'!H69","v":0},{"$f":"'Saisie 1V'!H69","v":0},{"$f":"F126-J126","v":0},{"$f":"'Saisie 1V'!I69:AM69","v":0},0,0,0,0,0,100,0,0,0,0,0,0,0,0,0,0,0,0,0,0,0,0,0,0,0,0,0,0,0,0,{"$f":"'Saisie 1V'!AN69:BR69","v":0},{"$f":"'Saisie 1V'!AO69:BS69","v":0},{"$f":"'Saisie 1V'!AP69:BT69","v":0}]
[0,0,0,0,{"$f":"E126/$D$126","v":{"$error":"#DIV/0!"}},{"$f":"IF(F126=0,\"\",F126/D126)","v":""},{"$f":"IF(G126=0,\"\",G126/D126)","v":""},null,null,{"$f":"IF(J126=0,\"\",J126/F126)","v":""},null,{"$f":"L126/$K$126","v":{"$error":"#DIV/0!"}},{"$f":"M126/$K$126","v":{"$error":"#DIV/0!"}},{"$error":"#DIV/0!"},{"$error":"#DIV/0!"},{"$error":"#DIV/0!"},{"$error":"#DIV/0!"},{"$error":"#DIV/0!"},{"$error":"#DIV/0!"},{"$error":"#DIV/0!"},{"$error":"#DIV/0!"},{"$error":"#DIV/0!"},{"$error":"#DIV/0!"},{"$error":"#DIV/0!"},{"$error":"#DIV/0!"},{"$error":"#DIV/0!"},{"$error":"#DIV/0!"},{"$error":"#DIV/0!"},{"$error":"#DIV/0!"},{"$error":"#DIV/0!"},{"$error":"#DIV/0!"},{"$error":"#DIV/0!"},{"$error":"#DIV/0!"},{"$error":"#DIV/0!"},{"$error":"#DIV/0!"},{"$error":"#DIV/0!"},{"$error":"#DIV/0!"},{"$error":"#DIV/0!"},{"$error":"#DIV/0!"},{"$error":"#DIV/0!"},{"$error":"#DIV/0!"},{"$error":"#DIV/0!"},{"$f":"AQ126/$K$126","v":{"$error":"#DIV/0!"}},{"$error":"#DIV/0!"},{"$error":"#DIV/0!"}]
[0,"Canton d'Orly","or",0,{"$f":"'Saisie 1V'!E70:F70","v":0},0,{"$f":"D128-F128","v":0},{"$f":"'Saisie 1V'!G70","v":0},{"$f":"'Saisie 1V'!H70","v":0},{"$f":"'Saisie 1V'!H71","v":0},{"$f":"F128-J128","v":0},{"$f":"'Saisie 1V'!I70:AM70","v":0},0,0,0,0,0,100,0,0,0,0,0,0,0,0,0,0,0,0,0,0,0,0,0,0,0,0,0,0,0,0,{"$f":"'Saisie 1V'!AN70:BR70","v":0},{"$f":"'Saisie 1V'!AO70:BS70","v":0},{"$f":"'Saisie 1V'!AP70:BT70","v":0}]
[0,0,0,0,{"$f":"E128/$D$128","v":{"$error":"#DIV/0!"}},{"$f":"IF(F128=0,\"\",F128/D128)","v":""},{"$f":"IF(G128=0,\"\",G128/D128)","v":""},null,null,{"$f":"IF(J128=0,\"\",J128/F128)","v":""},null,{"$f":"L128/$K$128","v":{"$error":"#DIV/0!"}},{"$f":"M128/$K$128","v":{"$error":"#DIV/0!"}},{"$error":"#DIV/0!"},{"$error":"#DIV/0!"},{"$error":"#DIV/0!"},{"$error":"#DIV/0!"},{"$error":"#DIV/0!"},{"$error":"#DIV/0!"},{"$error":"#DIV/0!"},{"$error":"#DIV/0!"},{"$error":"#DIV/0!"},{"$error":"#DIV/0!"},{"$error":"#DIV/0!"},{"$error":"#DIV/0!"},{"$error":"#DIV/0!"},{"$error":"#DIV/0!"},{"$error":"#DIV/0!"},{"$error":"#DIV/0!"},{"$error":"#DIV/0!"},{"$error":"#DIV/0!"},{"$error":"#DIV/0!"},{"$error":"#DIV/0!"},{"$error":"#DIV/0!"},{"$error":"#DIV/0!"},{"$error":"#DIV/0!"},{"$error":"#DIV/0!"},{"$error":"#DIV/0!"},{"$error":"#DIV/0!"},{"$error":"#DIV/0!"},{"$error":"#DIV/0!"},{"$error":"#DIV/0!"},{"$f":"AQ128/$K$128","v":{"$error":"#DIV/0!"}},{"$error":"#DIV/0!"},{"$error":"#DIV/0!"}]
[0,"a",0,0,{"$f":"'Saisie 1V'!E71:F71","v":0},0,{"$f":"D130-F130","v":0},{"$f":"'Saisie 1V'!G71","v":0},{"$f":"'Saisie 1V'!H71","v":0},{"$f":"'Saisie 1V'!H73","v":0},{"$f":"F130-J130","v":0},{"$f":"'Saisie 1V'!I71:AM71","v":0},0,0,0,0,0,100,0,0,0,0,0,0,0,0,0,0,0,0,0,0,0,0,0,0,0,0,0,0,0,0,{"$f":"'Saisie 1V'!AN71:BR71","v":0},{"$f":"'Saisie 1V'!AO71:BS71","v":0},{"$f":"'Saisie 1V'!AP71:BT71","v":0}]
[0,0,0,0,{"$f":"E130/$D$130","v":{"$error":"#DIV/0!"}},{"$f":"IF(F130=0,\"\",F130/D130)","v":""},{"$f":"IF(G130=0,\"\",G130/D130)","v":""},null,null,{"$f":"IF(J130=0,\"\",J130/F130)","v":""},null,{"$f":"L130/$K$130","v":{"$error":"#DIV/0!"}},{"$f":"M130/$K$130","v":{"$error":"#DIV/0!"}},{"$error":"#DIV/0!"},{"$error":"#DIV/0!"},{"$error":"#DIV/0!"},{"$error":"#DIV/0!"},{"$error":"#DIV/0!"},{"$error":"#DIV/0!"},{"$error":"#DIV/0!"},{"$error":"#DIV/0!"},{"$error":"#DIV/0!"},{"$error":"#DIV/0!"},{"$error":"#DIV/0!"},{"$error":"#DIV/0!"},{"$error":"#DIV/0!"},{"$error":"#DIV/0!"},{"$error":"#DIV/0!"},{"$error":"#DIV/0!"},{"$error":"#DIV/0!"},{"$error":"#DIV/0!"},{"$error":"#DIV/0!"},{"$error":"#DIV/0!"},{"$error":"#DIV/0!"},{"$error":"#DIV/0!"},{"$error":"#DIV/0!"},{"$error":"#DIV/0!"},{"$error":"#DIV/0!"},{"$error":"#DIV/0!"},{"$error":"#DIV/0!"},{"$error":"#DIV/0!"},{"$error":"#DIV/0!"},{"$f":"AQ130/$K$130","v":{"$error":"#DIV/0!"}},{"$error":"#DIV/0!"},{"$error":"#DIV/0!"}]
[0,"b",0,0,{"$f":"'Saisie 1V'!E72:F72","v":0},0,{"$f":"D132-F132","v":0},{"$f":"'Saisie 1V'!G72","v":0},{"$f":"'Saisie 1V'!H72","v":0},{"$f":"'Saisie 1V'!H75","v":0},{"$f":"F132-J132","v":0},{"$f":"'Saisie 1V'!I72:AM72","v":0},0,0,0,0,0,100,0,0,0,0,0,0,0,0,0,0,0,0,0,0,0,0,0,0,0,0,0,0,0,0,{"$f":"'Saisie 1V'!AN72:BR72","v":0},{"$f":"'Saisie 1V'!AO72:BS72","v":0},{"$f":"'Saisie 1V'!AP72:BT72","v":0}]
[0,0,0,0,{"$f":"E132/$D$132","v":{"$error":"#DIV/0!"}},{"$f":"IF(F132=0,\"\",F132/D132)","v":""},{"$f":"IF(G132=0,\"\",G132/D132)","v":""},null,null,{"$f":"IF(J132=0,\"\",J132/F132)","v":""},null,{"$f":"L132/$K$132","v":{"$error":"#DIV/0!"}},{"$f":"M132/$K$132","v":{"$error":"#DIV/0!"}},{"$error":"#DIV/0!"},{"$error":"#DIV/0!"},{"$error":"#DIV/0!"},{"$error":"#DIV/0!"},{"$error":"#DIV/0!"},{"$error":"#DIV/0!"},{"$error":"#DIV/0!"},{"$error":"#DIV/0!"},{"$error":"#DIV/0!"},{"$error":"#DIV/0!"},{"$error":"#DIV/0!"},{"$error":"#DIV/0!"},{"$error":"#DIV/0!"},{"$error":"#DIV/0!"},{"$error":"#DIV/0!"},{"$error":"#DIV/0!"},{"$error":"#DIV/0!"},{"$error":"#DIV/0!"},{"$error":"#DIV/0!"},{"$error":"#DIV/0!"},{"$error":"#DIV/0!"},{"$error":"#DIV/0!"},{"$error":"#DIV/0!"},{"$error":"#DIV/0!"},{"$error":"#DIV/0!"},{"$error":"#DIV/0!"},{"$error":"#DIV/0!"},{"$error":"#DIV/0!"},{"$error":"#DIV/0!"},{"$f":"AQ132/$K$132","v":{"$error":"#DIV/0!"}},{"$error":"#DIV/0!"},{"$error":"#DIV/0!"}]
[0,"c",0,0,{"$f":"'Saisie 1V'!E73:F73","v":0},0,{"$f":"D134-F134","v":0},{"$f":"'Saisie 1V'!G73","v":0},{"$f":"'Saisie 1V'!H73","v":0},{"$f":"'Saisie 1V'!H77","v":0},{"$f":"F134-J134","v":0},{"$f":"'Saisie 1V'!I73:AM73","v":0},0,0,0,0,0,100,0,0,0,0,0,0,0,0,0,0,0,0,0,0,0,0,0,0,0,0,0,0,0,0,{"$f":"'Saisie 1V'!AN73:BR73","v":0},{"$f":"'Saisie 1V'!AO73:BS73","v":0},{"$f":"'Saisie 1V'!AP73:BT73","v":0}]
[0,0,0,0,{"$f":"E134/$D$134","v":{"$error":"#DIV/0!"}},{"$f":"IF(F134=0,\"\",F134/D134)","v":""},{"$f":"IF(G134=0,\"\",G134/D134)","v":""},null,null,{"$f":"IF(J134=0,\"\",J134/F134)","v":""},null,{"$f":"L134/$K$134","v":{"$error":"#DIV/0!"}},{"$f":"M134/$K$134","v":{"$error":"#DIV/0!"}},{"$error":"#DIV/0!"},{"$error":"#DIV/0!"},{"$error":"#DIV/0!"},{"$error":"#DIV/0!"},{"$error":"#DIV/0!"},{"$error":"#DIV/0!"},{"$error":"#DIV/0!"},{"$error":"#DIV/0!"},{"$error":"#DIV/0!"},{"$error":"#DIV/0!"},{"$error":"#DIV/0!"},{"$error":"#DIV/0!"},{"$error":"#DIV/0!"},{"$error":"#DIV/0!"},{"$error":"#DIV/0!"},{"$error":"#DIV/0!"},{"$error":"#DIV/0!"},{"$error":"#DIV/0!"},{"$error":"#DIV/0!"},{"$error":"#DIV/0!"},{"$error":"#DIV/0!"},{"$error":"#DIV/0!"},{"$error":"#DIV/0!"},{"$error":"#DIV/0!"},{"$error":"#DIV/0!"},{"$error":"#DIV/0!"},{"$error":"#DIV/0!"},{"$error":"#DIV/0!"},{"$error":"#DIV/0!"},{"$f":"AQ134/$K$134","v":{"$error":"#DIV/0!"}},{"$error":"#DIV/0!"},{"$error":"#DIV/0!"}]
[0,"d",0,0,{"$f":"'Saisie 1V'!E74:F74","v":0},0,{"$f":"D136-F136","v":0},{"$f":"'Saisie 1V'!G74","v":0},{"$f":"'Saisie 1V'!H74","v":0},{"$f":"'Saisie 1V'!H79","v":0},{"$f":"F136-J136","v":0},{"$f":"'Saisie 1V'!I74:AM74","v":0},0,0,0,0,0,100,0,0,0,0,0,0,0,0,0,0,0,0,0,0,0,0,0,0,0,0,0,0,0,0,{"$f":"'Saisie 1V'!AN74:BR74","v":0},{"$f":"'Saisie 1V'!AO74:BS74","v":0},{"$f":"'Saisie 1V'!AP74:BT74","v":0}]
[0,0,0,0,{"$f":"E136/$D$136","v":{"$error":"#DIV/0!"}},{"$f":"IF(F136=0,\"\",F136/D136)","v":""},{"$f":"IF(G136=0,\"\",G136/D136)","v":""},null,null,{"$f":"IF(J136=0,\"\",J136/F136)","v":""},null,{"$f":"L136/$K$136","v":{"$error":"#DIV/0!"}},{"$f":"M136/$K$136","v":{"$error":"#DIV/0!"}},{"$error":"#DIV/0!"},{"$error":"#DIV/0!"},{"$error":"#DIV/0!"},{"$error":"#DIV/0!"},{"$error":"#DIV/0!"},{"$error":"#DIV/0!"},{"$error":"#DIV/0!"},{"$error":"#DIV/0!"},{"$error":"#DIV/0!"},{"$error":"#DIV/0!"},{"$error":"#DIV/0!"},{"$error":"#DIV/0!"},{"$error":"#DIV/0!"},{"$error":"#DIV/0!"},{"$error":"#DIV/0!"},{"$error":"#DIV/0!"},{"$error":"#DIV/0!"},{"$error":"#DIV/0!"},{"$error":"#DIV/0!"},{"$error":"#DIV/0!"},{"$error":"#DIV/0!"},{"$error":"#DIV/0!"},{"$error":"#DIV/0!"},{"$error":"#DIV/0!"},{"$error":"#DIV/0!"},{"$error":"#DIV/0!"},{"$error":"#DIV/0!"},{"$error":"#DIV/0!"},{"$error":"#DIV/0!"},{"$f":"AQ136/$K$136","v":{"$error":"#DIV/0!"}},{"$error":"#DIV/0!"},{"$error":"#DIV/0!"}]
[0,"e",0,0,{"$f":"'Saisie 1V'!E75:F75","v":0},0,{"$f":"D138-F138","v":0},{"$f":"'Saisie 1V'!G75","v":0},{"$f":"'Saisie 1V'!H75","v":0},{"$f":"'Saisie 1V'!H81","v":0},{"$f":"F138-J138","v":0},{"$f":"'Saisie 1V'!I75:AM75","v":0},0,0,0,0,0,100,0,0,0,0,0,0,0,0,0,0,0,0,0,0,0,0,0,0,0,0,0,0,0,0,{"$f":"'Saisie 1V'!AN75:BR75","v":0},{"$f":"'Saisie 1V'!AO75:BS75","v":0},{"$f":"'Saisie 1V'!AP75:BT75","v":0}]
[0,0,0,0,{"$f":"E138/$D$138","v":{"$error":"#DIV/0!"}},{"$f":"IF(F138=0,\"\",F138/D138)","v":""},{"$f":"IF(G138=0,\"\",G138/D138)","v":""},null,null,{"$f":"IF(J138=0,\"\",J138/F138)","v":""},null,{"$f":"L138/$K$138","v":{"$error":"#DIV/0!"}},{"$f":"M138/$K$138","v":{"$error":"#DIV/0!"}},{"$error":"#DIV/0!"},{"$error":"#DIV/0!"},{"$error":"#DIV/0!"},{"$error":"#DIV/0!"},{"$error":"#DIV/0!"},{"$error":"#DIV/0!"},{"$error":"#DIV/0!"},{"$error":"#DIV/0!"},{"$error":"#DIV/0!"},{"$error":"#DIV/0!"},{"$error":"#DIV/0!"},{"$error":"#DIV/0!"},{"$error":"#DIV/0!"},{"$error":"#DIV/0!"},{"$error":"#DIV/0!"},{"$error":"#DIV/0!"},{"$error":"#DIV/0!"},{"$error":"#DIV/0!"},{"$error":"#DIV/0!"},{"$error":"#DIV/0!"},{"$error":"#DIV/0!"},{"$error":"#DIV/0!"},{"$error":"#DIV/0!"},{"$error":"#DIV/0!"},{"$error":"#DIV/0!"},{"$error":"#DIV/0!"},{"$error":"#DIV/0!"},{"$error":"#DIV/0!"},{"$error":"#DIV/0!"},{"$f":"AQ138/$K$138","v":{"$error":"#DIV/0!"}},{"$error":"#DIV/0!"},{"$error":"#DIV/0!"}]
[]
[]
[]
[null,"COMMUNE DE CRETEIL",null,{"$f":"DSUM(BASE,2,CR)","v":43764},{"$f":"DSUM(BASE,3,CR)","v":0},{"$f":"DSUM(BASE,4,CR)","v":19777},{"$f":"DSUM(BASE,5,CR)","v":23987},{"$f":"DSUM(BASE,6,CR)","v":394},{"$f":"DSUM(BASE,7,CR)","v":323},{"$f":"DSUM(BASE,8,CR)","v":717},{"$f":"DSUM(BASE,9,CR)","v":19060},{"$f":"DSUM(BASE,10,CR)","v":1751},{"$f":"DSUM(BASE,11,CR)","v":1},{"$f":"DSUM(BASE,12,CR)","v":3},{"$f":"DSUM(BASE,13,CR)","v":88},{"$f":"DSUM(BASE,14,CR)","v":4557},{"$f":"DSUM(BASE,15,CR)","v":0},{"$f":"DSUM(BASE,16,CR)","v":58},{"$f":"DSUM(BASE,17,CR)","v":4},{"$f":"DSUM(BASE,18,CR)","v":399},{"$f":"DSUM(BASE,19,CR)","v":2},{"$f":"DSUM(BASE,20,CR)","v":428},{"$f":"DSUM(BASE,21,CR)","v":1584},{"$f":"DSUM(BASE,22,CR)","v":20},{"$f":"DSUM(BASE,23,CR)","v":0},{"$f":"DSUM(BASE,24,CR)","v":576},{"$f":"DSUM(BASE,25,CR)","v":2},{"$f":"DSUM(BASE,26,CR)","v":6},{"$f":"DSUM(BASE,27,CR)","v":123},{"$f":"DSUM(BASE,28,CR)","v":614},{"$f":"DSUM(BASE,29,CR)","v":354},{"$f":"DSUM(BASE,30,CR)","v":918},{"$f":"DSUM(BASE,31,CR)","v":7},{"$f":"DSUM(BASE,32,CR)","v":2590},{"$f":"DSUM(BASE,33,CR)","v":0},{"$f":"DSUM(BASE,34,CR)","v":0},{"$f":"DSUM(BASE,35,CR)","v":12},{"$f":"DSUM(BASE,36,CR)","v":0},{"$f":"DSUM(BASE,37,CR)","v":73},{"$f":"DSUM(BASE,38,CR)","v":1306},{"$f":"DSUM(BASE,39,CR)","v":2700},{"$f":"DSUM(BASE,40,CR)","v":412},{"$f":"DSUM(BASE,41,CR)","v":35},{"$f":"DSUM(BASE,42,CR)","v":30},{"$f":"DSUM(BASE,43,CR)","v":407}]
[null,null,null,null,{"$f":"E143/$D$143","v":0},{"$f":"F143/$D$143","v":0.45190110593181609},{"$f":"G143/$D$143","v":0.54809889406818391},null,null,{"$f":"J143/$F$143","v":3.6254234717095615E-2},null,{"$f":"L143/$K$143","v":9.1867785939139565E-2},5.246589716684155E-5,1.5739769150052466E-4,4.6169989506820563E-3,0.23908709338929696,0,3.0430220356768099E-3,2.098635886673662E-4,2.0933892969569781E-2,1.049317943336831E-4,2.2455403987408185E-2,8.3105981112277016E-2,1.0493179433368311E-3,0,3.0220356768100736E-2,1.049317943336831E-4,3.1479538300104932E-4,6.453305351521511E-3,3.2214060860440714E-2,1.857292759706191E-2,4.8163693599160548E-2,3.6726128016789086E-4,0.13588667366211962,0,0,6.2959076600209863E-4,0,3.8300104931794335E-3,6.8520461699895063E-2,0.1416579223504722,{"$f":"AP143/$K$143","v":2.1615949632738721E-2},{"$f":"AQ143/$K$143","v":1.8363064008394543E-3},1.5739769150052466E-3,2.1353620146904513E-2]
[]
[]
[]
[]
[]
[]
[]
[null,{"$f":"GE!B170","v":"Canton n° 7"},null,{"$f":"DSUM(BASE,2,CR_7)","v":21252},{"$f":"DSUM(BASE,3,CR_7)","v":0},{"$f":"DSUM(BASE,4,CR_7)","v":9474},{"$f":"DSUM(BASE,5,CR_7)","v":11778},{"$f":"DSUM(BASE,6,CR_7)","v":192},{"$f":"DSUM(BASE,7,CR_7)","v":150},{"$f":"DSUM(BASE,8,CR_7)","v":342},{"$f":"DSUM(BASE,9,CR_7)","v":9132},{"$f":"DSUM(BASE,10,CR_7)","v":888},{"$f":"DSUM(BASE,11,CR_7)","v":1},{"$f":"DSUM(BASE,12,CR_7)","v":3},{"$f":"DSUM(BASE,13,CR_7)","v":58},{"$f":"DSUM(BASE,14,CR_7)","v":2202},{"$f":"DSUM(BASE,15,CR_7)","v":0},{"$f":"DSUM(BASE,16,CR_7)","v":22},{"$f":"DSUM(BASE,17,CR_7)","v":2},{"$f":"DSUM(BASE,18,CR_7)","v":193},{"$f":"DSUM(BASE,19,CR_7)","v":2},{"$f":"DSUM(BASE,20,CR_7)","v":223},{"$f":"DSUM(BASE,21,CR_7)","v":719},{"$f":"DSUM(BASE,22,CR_7)","v":11},{"$f":"DSUM(BASE,23,CR_7)","v":0},{"$f":"DSUM(BASE,24,CR_7)","v":272},{"$f":"DSUM(BASE,25,CR_7)","v":1},{"$f":"DSUM(BASE,26,CR_7)","v":4},{"$f":"DSUM(BASE,27,CR_7)","v":70},{"$f":"DSUM(BASE,28,CR_7)","v":299},{"$f":"DSUM(BASE,29,CR_7)","v":194},{"$f":"DSUM(BASE,30,CR_7)","v":443},{"$f":"DSUM(BASE,31,CR_7)","v":7},{"$f":"DSUM(BASE,32,CR_7)","v":1213},{"$f":"DSUM(BASE,33,CR_7)","v":0},{"$f":"DSUM(BASE,34,CR_7)","v":0},{"$f":"DSUM(BASE,35,CR_7)","v":5},{"$f":"DSUM(BASE,36,CR_7)","v":0},{"$f":"DSUM(BASE,37,CR_7)","v":46},{"$f":"DSUM(BASE,38,CR_7)","v":651},{"$f":"DSUM(BASE,39,CR_7)","v":1201},{"$f":"DSUM(BASE,40,CR_7)","v":176},{"$f":"DSUM(BASE,40,CR_7)","v":176},{"$f":"DSUM(BASE,40,CR_7)","v":176},{"$f":"DSUM(BASE,40,CR_7)","v":176}]
[null,null,null,null,{"$f":"E152/$D$152","v":0},{"$f":"F152/D152","v":0.44579333709768493},{"$f":"G152/D152","v":0.55420666290231513},null,null,{"$f":"J152/$F$152","v":3.6098796706776438E-2},null,{"$f":"L152/$K$152","v":9.724047306176084E-2},1.0950503723171266E-4,3.2851511169513798E-4,6.3512921594393338E-3,0.24113009198423127,0,2.4091108190976785E-3,2.1901007446342531E-4,2.1134472185720544E-2,2.1901007446342531E-4,2.4419623302671924E-2,7.8734121769601401E-2,1.2045554095488392E-3,0,2.9785370127025843E-2,1.0950503723171266E-4,4.3802014892685063E-4,7.6653526062198862E-3,3.2742006132282085E-2,2.1243977222952255E-2,4.8510731493648707E-2,7.6653526062198866E-4,0.13282961016206746,0,0,5.4752518615856327E-4,0,5.0372317126587823E-3,7.1287779237844948E-2,0.13151554971528689,1.9272886552781428E-2,{"$f":"AQ152/$K$152","v":1.9272886552781428E-2},1.9272886552781428E-2,1.9272886552781428E-2]
[]
[]
[null,{"$f":"GE!B172","v":"Canton n° 8"},null,{"$f":"DSUM(BASE,2,CR_8)","v":22512},{"$f":"DSUM(BASE,3,CR_8)","v":0},{"$f":"DSUM(BASE,4,CR_8)","v":10303},{"$f":"DSUM(BASE,5,CR_8)","v":12209},{"$f":"DSUM(BASE,6,CR_8)","v":202},{"$f":"DSUM(BASE,7,CR_8)","v":173},{"$f":"DSUM(BASE,8,CR_8)","v":375},{"$f":"DSUM(BASE,9,CR_8)","v":9928},{"$f":"DSUM(BASE,10,CR_8)","v":863},{"$f":"DSUM(BASE,11,CR_8)","v":0},{"$f":"DSUM(BASE,12,CR_8)","v":0},{"$f":"DSUM(BASE,13,CR_8)","v":30},{"$f":"DSUM(BASE,14,CR_8)","v":2355},{"$f":"DSUM(BASE,15,CR_8)","v":0},{"$f":"DSUM(BASE,16,CR_8)","v":36},{"$f":"DSUM(BASE,17,CR_8)","v":2},{"$f":"DSUM(BASE,18,CR_8)","v":206},{"$f":"DSUM(BASE,19,CR_8)","v":0},{"$f":"DSUM(BASE,20,CR_8)","v":205},{"$f":"DSUM(BASE,21,CR_8)","v":865},{"$f":"DSUM(BASE,22,CR_8)","v":9},{"$f":"DSUM(BASE,23,CR_8)","v":0},{"$f":"DSUM(BASE,24,CR_8)","v":304},{"$f":"DSUM(BASE,25,CR_8)","v":1},{"$f":"DSUM(BASE,26,CR_8)","v":2},{"$f":"DSUM(BASE,27,CR_8)","v":53},{"$f":"DSUM(BASE,28,CR_8)","v":315},{"$f":"DSUM(BASE,29,CR_8)","v":160},{"$f":"DSUM(BASE,30,CR_8)","v":475},{"$f":"DSUM(BASE,31,CR_8)","v":0},{"$f":"DSUM(BASE,32,CR_8)","v":1377},{"$f":"DSUM(BASE,33,CR_8)","v":0},{"$f":"DSUM(BASE,34,CR_8)","v":0},{"$f":"DSUM(BASE,35,CR_8)","v":7},{"$f":"DSUM(BASE,36,CR_8)","v":0},{"$f":"DSUM(BASE,37,CR_8)","v":27},{"$f":"DSUM(BASE,38,CR_8)","v":655},{"$f":"DSUM(BASE,39,CR_8)","v":1499},{"$f":"DSUM(BASE,40,CR_8)","v":236},{"$f":"DSUM(BASE,40,CR_8)","v":236},{"$f":"DSUM(BASE,40,CR_8)","v":236},{"$f":"DSUM(BASE,40,CR_8)","v":236}]
[null,null,null,null,{"$f":"E156/$D$156","v":0},{"$f":"F156/D156","v":0.45766702203269366},{"$f":"G156/D156","v":0.54233297796730628},null,null,{"$f":"J156/$F$156","v":3.6397165874017277E-2},null,{"$f":"L156/$K$156","v":8.6925866236905722E-2},0,0,3.0217566478646252E-3,0.23720789685737309,0,3.6261079774375505E-3,2.0145044319097501E-4,2.0749395648670427E-2,0,2.0648670427074939E-2,8.7127316680096697E-2,9.0652699435938764E-4,0,3.0620467365028204E-2,1.0072522159548751E-4,2.0145044319097501E-4,5.3384367445608377E-3,3.1728444802578568E-2,1.6116035455278E-2,4.7844480257856564E-2,0,0.1386986301369863,0,0,7.0507655116841257E-4,0,2.7195809830781628E-3,6.5975020145044319E-2,0.15098710717163577,2.3771152296535054E-2,{"$f":"AQ156/$K$156","v":2.3771152296535054E-2},2.3771152296535054E-2,2.3771152296535054E-2]
[]
[]
[null,"1ère circonscription",null,{"$f":"DSUM(BASE,2,CR_VM1)","v":13172},{"$f":"DSUM(BASE,3,CR_VM1)","v":0},{"$f":"DSUM(BASE,4,CR_VM1)","v":7180},{"$f":"DSUM(BASE,5,CR_VM1)","v":5992},{"$f":"DSUM(BASE,6,CR_VM1)","v":129},{"$f":"DSUM(BASE,7,CR_VM1)","v":90},{"$f":"DSUM(BASE,8,CR_VM1)","v":219},{"$f":"DSUM(BASE,9,CR_VM1)","v":6961},{"$f":"DSUM(BASE,10,CR_VM1)","v":402},{"$f":"DSUM(BASE,11,CR_VM1)","v":0},{"$f":"DSUM(BASE,12,CR_VM1)","v":0},{"$f":"DSUM(BASE,13,CR_VM1)","v":23},{"$f":"DSUM(BASE,14,CR_VM1)","v":1918},{"$f":"DSUM(BASE,15,CR_VM1)","v":0},{"$f":"DSUM(BASE,16,CR_VM1)","v":19},{"$f":"DSUM(BASE,17,CR_VM1)","v":2},{"$f":"DSUM(BASE,18,CR_VM1)","v":142},{"$f":"DSUM(BASE,19,CR_VM1)","v":0},{"$f":"DSUM(BASE,20,CR_VM1)","v":166},{"$f":"DSUM(BASE,21,CR_VM1)","v":584},{"$f":"DSUM(BASE,22,CR_VM1)","v":7},{"$f":"DSUM(BASE,23,CR_VM1)","v":0},{"$f":"DSUM(BASE,24,CR_VM1)","v":222},{"$f":"DSUM(BASE,25,CR_VM1)","v":1},{"$f":"DSUM(BASE,26,CR_VM1)","v":3},{"$f":"DSUM(BASE,27,CR_VM1)","v":26},{"$f":"DSUM(BASE,28,CR_VM1)","v":196},{"$f":"DSUM(BASE,29,CR_VM1)","v":99},{"$f":"DSUM(BASE,30,CR_VM1)","v":275},{"$f":"DSUM(BASE,31,CR_VM1)","v":4},{"$f":"DSUM(BASE,32,CR_VM1)","v":894},{"$f":"DSUM(BASE,33,CR_VM1)","v":0},{"$f":"DSUM(BASE,34,CR_VM1)","v":0},{"$f":"DSUM(BASE,35,CR_VM1)","v":5},{"$f":"DSUM(BASE,36,CR_VM1)","v":0},{"$f":"DSUM(BASE,37,CR_VM1)","v":19},{"$f":"DSUM(BASE,38,CR_VM1)","v":538},{"$f":"DSUM(BASE,39,CR_VM1)","v":1197},{"$f":"DSUM(BASE,40,CR_VM1)","v":151},{"$f":"DSUM(BASE,40,CR_VM1)","v":151},{"$f":"DSUM(BASE,40,CR_VM1)","v":151},{"$f":"DSUM(BASE,40,CR_VM1)","v":151}]
[null," de Créteil",null,null,{"$f":"E160/$D$160","v":0},{"$f":"F160/D160","v":0.54509565745520805},{"$f":"G160/D160","v":0.45490434254479201},null,null,{"$f":"J160/$F$160","v":3.0501392757660166E-2},null,{"$f":"L160/$K$160","v":5.7750323229421058E-2},0,0,3.3041229708375233E-3,0.2755351242637552,0,2.7294928889527365E-3,2.8731504094239331E-4,2.0399367906909927E-2,0,2.3847148398218648E-2,8.3895991955178856E-2,1.0056026432983766E-3,0,3.1891969544605658E-2,1.4365752047119666E-4,4.3097256141358999E-4,3.7350955322511133E-3,2.8156874012354546E-2,1.4222094526648471E-2,3.9505818129579082E-2,5.7463008188478662E-4,0.12842982330124983,0,0,7.1828760235598331E-4,0,2.7294928889527365E-3,7.7287746013503814E-2,0.17195805200402242]
[]
[]
[null,"2ème circonscription",null,{"$f":"DSUM(BASE,2,CR_VM2)","v":30592},{"$f":"DSUM(BASE,3,CR_VM2)","v":0},{"$f":"DSUM(BASE,4,CR_VM2)","v":12597},{"$f":"DSUM(BASE,5,CR_VM2)","v":17995},{"$f":"DSUM(BASE,6,CR_VM2)","v":265},{"$f":"DSUM(BASE,7,CR_VM2)","v":233},{"$f":"DSUM(BASE,8,CR_VM2)","v":498},{"$f":"DSUM(BASE,9,CR_VM2)","v":12099},{"$f":"DSUM(BASE,10,CR_VM2)","v":1349},{"$f":"DSUM(BASE,11,CR_VM2)","v":1},{"$f":"DSUM(BASE,12,CR_VM2)","v":3},{"$f":"DSUM(BASE,13,CR_VM2)","v":65},{"$f":"DSUM(BASE,14,CR_VM2)","v":2639},{"$f":"DSUM(BASE,15,CR_VM2)","v":0},{"$f":"DSUM(BASE,16,CR_VM2)","v":39},{"$f":"DSUM(BASE,17,CR_VM2)","v":2},{"$f":"DSUM(BASE,18,CR_VM2)","v":257},{"$f":"DSUM(BASE,19,CR_VM2)","v":2},{"$f":"DSUM(BASE,20,CR_VM2)","v":262},{"$f":"DSUM(BASE,21,CR_VM2)","v":1000},{"$f":"DSUM(BASE,22,CR_VM2)","v":13},{"$f":"DSUM(BASE,23,CR_VM2)","v":0},{"$f":"DSUM(BASE,24,CR_VM2)","v":354},{"$f":"DSUM(BASE,25,CR_VM2)","v":1},{"$f":"DSUM(BASE,26,CR_VM2)","v":3},{"$f":"DSUM(BASE,27,CR_VM2)","v":97},{"$f":"DSUM(BASE,28,CR_VM2)","v":418},{"$f":"DSUM(BASE,29,CR_VM2)","v":255},{"$f":"DSUM(BASE,30,CR_VM2)","v":643},{"$f":"DSUM(BASE,31,CR_VM2)","v":3},{"$f":"DSUM(BASE,32,CR_VM2)","v":1696},{"$f":"DSUM(BASE,33,CR_VM2)","v":0},{"$f":"DSUM(BASE,34,CR_VM2)","v":0},{"$f":"DSUM(BASE,35,CR_VM2)","v":7},{"$f":"DSUM(BASE,36,CR_VM2)","v":0},{"$f":"DSUM(BASE,37,CR_VM2)","v":54},{"$f":"DSUM(BASE,38,CR_VM2)","v":768},{"$f":"DSUM(BASE,39,CR_VM2)","v":1503},{"$f":"DSUM(BASE,40,CR_VM2)","v":261},{"$f":"DSUM(BASE,40,CR_VM2)","v":261},{"$f":"DSUM(BASE,40,CR_VM2)","v":261},{"$f":"DSUM(BASE,40,CR_VM2)","v":261}]
[null," de Créteil",null,null,{"$f":"E164/$D$164","v":0},{"$f":"F164/D164","v":0.41177432008368203},{"$f":"G164/D164","v":0.58822567991631802},null,null,{"$f":"J164/$F$164","v":3.9533222195760893E-2},null,{"$f":"L164/$K$164","v":0.11149681791883627},8.2651458798247785E-5,2.4795437639474338E-4,5.3723448218861063E-3,0.21811719976857591,0,3.223406893131664E-3,1.6530291759649557E-4,2.1241424911149682E-2,1.6530291759649557E-4,2.165468220514092E-2,8.2651458798247784E-2,1.0744689643772212E-3,0,2.9258616414579719E-2,8.2651458798247785E-5,2.4795437639474338E-4,8.0171915034300354E-3,3.4548309777667575E-2,2.1076121993553187E-2,5.3144888007273329E-2,2.4795437639474338E-4,0.14017687412182825,0,0,5.7856021158773452E-4,0,4.4631787751053809E-3,6.3476320357054306E-2,0.12422514257376643]
[]
[]
[null,"1ère circonscription",null,{"$f":"DSUM(BASE,2,_VM1)","v":13172},{"$f":"DSUM(BASE,3,_VM1)","v":0},{"$f":"DSUM(BASE,4,_VM1)","v":7180},{"$f":"DSUM(BASE,5,_VM1)","v":5992},{"$f":"DSUM(BASE,6,_VM1)","v":129},{"$f":"DSUM(BASE,7,_VM1)","v":90},{"$f":"DSUM(BASE,8,_VM1)","v":219},{"$f":"DSUM(BASE,9,_VM1)","v":6961},{"$f":"DSUM(BASE,10,_VM1)","v":402},{"$f":"DSUM(BASE,11,_VM1)","v":0},{"$f":"DSUM(BASE,12,_VM1)","v":0},{"$f":"DSUM(BASE,13,_VM1)","v":23},{"$f":"DSUM(BASE,14,_VM1)","v":1918},{"$f":"DSUM(BASE,15,_VM1)","v":0},{"$f":"DSUM(BASE,16,_VM1)","v":319},{"$f":"DSUM(BASE,17,_VM1)","v":2},{"$f":"DSUM(BASE,18,_VM1)","v":142},{"$f":"DSUM(BASE,19,_VM1)","v":0},{"$f":"DSUM(BASE,20,_VM1)","v":166},{"$f":"DSUM(BASE,21,_VM1)","v":584},{"$f":"DSUM(BASE,22,_VM1)","v":7},{"$f":"DSUM(BASE,23,_VM1)","v":0},{"$f":"DSUM(BASE,24,_VM1)","v":222},{"$f":"DSUM(BASE,25,_VM1)","v":1},{"$f":"DSUM(BASE,26,_VM1)","v":3},{"$f":"DSUM(BASE,27,_VM1)","v":26},{"$f":"DSUM(BASE,28,_VM1)","v":196},{"$f":"DSUM(BASE,29,_VM1)","v":99},{"$f":"DSUM(BASE,30,_VM1)","v":275},{"$f":"DSUM(BASE,31,_VM1)","v":4},{"$f":"DSUM(BASE,32,_VM1)","v":894},{"$f":"DSUM(BASE,33,_VM1)","v":0},{"$f":"DSUM(BASE,34,_VM1)","v":0},{"$f":"DSUM(BASE,35,_VM1)","v":5},{"$f":"DSUM(BASE,36,_VM1)","v":0},{"$f":"DSUM(BASE,37,_VM1)","v":19},{"$f":"DSUM(BASE,38,_VM1)","v":538},{"$f":"DSUM(BASE,39,_VM1)","v":1197},{"$f":"DSUM(BASE,40,_VM1)","v":151},{"$f":"DSUM(BASE,40,_VM1)","v":151},{"$f":"DSUM(BASE,40,_VM1)","v":151},{"$f":"DSUM(BASE,40,_VM1)","v":151}]
[null,"du Val de Marne",null,null,{"$f":"E168/$D$168","v":0},{"$f":"F168/D168","v":0.54509565745520805},{"$f":"G168/D168","v":0.45490434254479201},null,null,{"$f":"J168/$F$168","v":3.0501392757660166E-2},null,{"$f":"L168/$K$168","v":5.7750323229421058E-2},0,0,3.3041229708375233E-3,0.2755351242637552,0,4.5826749030311739E-2,2.8731504094239331E-4,2.0399367906909927E-2,0,2.3847148398218648E-2,8.3895991955178856E-2,1.0056026432983766E-3,0,3.1891969544605658E-2,1.4365752047119666E-4,4.3097256141358999E-4,3.7350955322511133E-3,2.8156874012354546E-2,1.4222094526648471E-2,3.9505818129579082E-2,5.7463008188478662E-4,0.12842982330124983,0,0,7.1828760235598331E-4,0,2.7294928889527365E-3,7.7287746013503814E-2,0.17195805200402242]
[]
[]
[null,"2ème circonscription",null,{"$f":"DSUM(BASE,2,_VM2)","v":30592},{"$f":"DSUM(BASE,3,_VM2)","v":0},{"$f":"DSUM(BASE,4,_VM2)","v":12597},{"$f":"DSUM(BASE,5,_VM2)","v":17995},{"$f":"DSUM(BASE,6,_VM2)","v":265},{"$f":"DSUM(BASE,7,_VM2)","v":233},{"$f":"DSUM(BASE,8,_VM2)","v":498},{"$f":"DSUM(BASE,9,_VM2)","v":12099},{"$f":"DSUM(BASE,10,_VM2)","v":1349},{"$f":"DSUM(BASE,11,_VM2)","v":1},{"$f":"DSUM(BASE,12,_VM2)","v":3},{"$f":"DSUM(BASE,13,_VM2)","v":65},{"$f":"DSUM(BASE,14,_VM2)","v":2639},{"$f":"DSUM(BASE,15,_VM2)","v":0},{"$f":"DSUM(BASE,16,_VM2)","v":139},{"$f":"DSUM(BASE,17,_VM2)","v":2},{"$f":"DSUM(BASE,18,_VM2)","v":257},{"$f":"DSUM(BASE,19,_VM2)","v":2},{"$f":"DSUM(BASE,20,_VM2)","v":262},{"$f":"DSUM(BASE,21,_VM2)","v":1000},{"$f":"DSUM(BASE,22,_VM2)","v":13},{"$f":"DSUM(BASE,23,_VM2)","v":0},{"$f":"DSUM(BASE,24,_VM2)","v":354},{"$f":"DSUM(BASE,25,_VM2)","v":1},{"$f":"DSUM(BASE,26,_VM2)","v":3},{"$f":"DSUM(BASE,27,_VM2)","v":97},{"$f":"DSUM(BASE,28,_VM2)","v":418},{"$f":"DSUM(BASE,29,_VM2)","v":255},{"$f":"DSUM(BASE,30,_VM2)","v":643},{"$f":"DSUM(BASE,31,_VM2)","v":3},{"$f":"DSUM(BASE,32,_VM2)","v":1696},{"$f":"DSUM(BASE,33,_VM2)","v":0},{"$f":"DSUM(BASE,34,_VM2)","v":0},{"$f":"DSUM(BASE,35,_VM2)","v":7},{"$f":"DSUM(BASE,36,_VM2)","v":0},{"$f":"DSUM(BASE,37,_VM2)","v":54},{"$f":"DSUM(BASE,38,_VM2)","v":768},{"$f":"DSUM(BASE,39,_VM2)","v":1503},{"$f":"DSUM(BASE,40,_VM2)","v":261},{"$f":"DSUM(BASE,40,_VM2)","v":261},{"$f":"DSUM(BASE,40,_VM2)","v":261},{"$f":"DSUM(BASE,40,_VM2)","v":261}]
[null,"du Val de Marne",null,null,{"$f":"E172/$D$172","v":0},{"$f":"F172/D172","v":0.41177432008368203},{"$f":"G172/D172","v":0.58822567991631802},null,null,{"$f":"J172/F172","v":3.9533222195760893E-2},null,{"$f":"L172/$K$172","v":0.11149681791883627},8.2651458798247785E-5,2.4795437639474338E-4,5.3723448218861063E-3,0.21811719976857591,0,1.1488552772956443E-2,1.6530291759649557E-4,2.1241424911149682E-2,1.6530291759649557E-4,2.165468220514092E-2,8.2651458798247784E-2,1.0744689643772212E-3,0,2.9258616414579719E-2,8.2651458798247785E-5,2.4795437639474338E-4,8.0171915034300354E-3,3.4548309777667575E-2,2.1076121993553187E-2,5.3144888007273329E-2,2.4795437639474338E-4,0.14017687412182825,0,0,5.7856021158773452E-4,0,4.4631787751053809E-3,6.3476320357054306E-2,0.12422514257376643]

{"sheet":"Synthèse 1V","index":4,"n_rows":65,"n_cols":38,"rows_kept":65,"cut":false,"hidden":true,"merged":[[1,0,1,11],[0,0,0,11]]}
[{"$f":"'1CA'!A1","v":"VILLE DE CRETEIL\n\nELECTIONS EUROPEENNES\n26 MAI 2019"}]
[{"$f":"'1CA'!A2","v":0}]
[]
[{"$f":"NOW()","v":"2019-05-26T23:05:47.390"}]
[null,"cantons","inscrits","émarge\nments","bulletins","abstentions","blancs et nuls","exprimés",{"$f":"'Résultats 1V'!L5:AO5","v":"FRANCE INSOUMISE conduite par\nM. AUBRY"},"FRANCE ROYALE conduite par \nR. de PREVOISIN","LIGNE CLAIRE conduite par\nR. CAMUS","PARTI PIRATE conduite par \nF. MARIE","RÉPUBLIQUE EN MARCHE conduite par \nN. LOISEAU","DÉMOCRATIE RÉPRESENTATIVE conduite par \nH. TRAORE","PATRIOTES ET GILETS JAUNES conduite par \nF. PHILIPPOT","PACE conduite par \nA. ALEXANDRE","URGENCE ÉCOLOGIE conduite par \nD. BOURG","LISTE DE LA RECONQUÊTE conduite par \nV. VAUCLIN","LES EUROPÉENS conduite par \nJ-C. LAGARDE","ENVIE D’EUROPE conduite par \nR. GLUCKSMANN","PARTI FÉDÉRALISTE EUROPÉEN conduite par \nY. GERNIGON","MOUVEMENT POUR L’INITIATIVE CITOYENNE conduite par \nG. HELGEN","LE COURAGE DE DÉFENDRE LES FRANÇAIS conduite par \nN. DUPONT-AIGNAN","ALLONS ENFANTS conduite par \nS. CAILLAUD","DÉCROISSANCE 2019 conduite par \nT. DELFEL","LUTTE OUVRIERE conduite par \nN. ARTHAUD","POUR L’EUROPE DES GENS conduite par \nI. BROSSAT","ENSEMBLE POUR LE FREXIT conduite par \nF. ASSELINEAU","LISTE CITOYENNE DU PRINTEMPS EUROPEEN conduite par \nB. HAMON","À VOIX ÉGALES conduite par \nN. TOMASINI","PRENEZ LE POUVOIR conduite par \nJ. BARDELLA","NEUTRE ET ACTIF conduite par \nC. CORBET","PARTI RÉVOLUTIONNAIRE COMMUNISTES conduite par \nA. SANCHEZ","ESPÉRANTO conduite par \nP. DIEUMEGARD","ÉVOLUTION CITOYENNE conduite par \nC. CHALANCON","ALLIANCE JAUNE conduite par \nF. LALANNE","UNION DE LA DROITE ET DU CENTRE conduite par \nF. X. BELLAMY","EUROPE ÉCOLOGIE conduite par \nY. JADOT"]
[]
[{"$f":"'Résultats 1V'!B143:AO144","v":"COMMUNE DE CRETEIL"},0,43764,0,19777,23987,394,323,717,19060,1751,1,3,88,4557,0,58,4,399,2,428,1584,20,0,576,2,6,123,614,354,918,7,2590,0,0,12,0,73]
[0,0,0,0,0.45190110593181609,0.54809889406818391,0,0,3.6254234717095615E-2,0,9.1867785939139565E-2,5.246589716684155E-5,1.5739769150052466E-4,4.6169989506820563E-3,0.23908709338929696,0,3.0430220356768099E-3,2.098635886673662E-4,2.0933892969569781E-2,1.049317943336831E-4,2.2455403987408185E-2,8.3105981112277016E-2,1.0493179433368311E-3,0,3.0220356768100736E-2,1.049317943336831E-4,3.1479538300104932E-4,6.453305351521511E-3,3.2214060860440714E-2,1.857292759706191E-2,4.8163693599160548E-2,3.6726128016789086E-4,0.13588667366211962,0,0,6.2959076600209863E-4,0,3.8300104931794335E-3]
[]
[]
[{"$f":"'Résultats 1V'!B148:AO149","v":0},0,0,0,0,0,0,0,0,0,0,0,0,0,0,0,0,0,0,0,0,0,0,0,0,0,0,0,0,0,0,0,0,0,0,0,0,0]
[0,0,0,0,0,0,0,0,0,0,0,0,0,0,0,0,0,0,0,0,0,0,0,0,0,0,0,0,0,0,0,0,0,0,0,0,0,0]
[]
[{"$f":"'Résultats 1V'!B152:AO153","v":"Canton n° 7"},0,21252,0,9474,11778,192,150,342,9132,888,1,3,58,2202,0,22,2,193,2,223,719,11,0,272,1,4,70,299,194,443,7,1213,0,0,5,0,46]
[0,0,0,0,0.44579333709768493,0.55420666290231513,0,0,3.6098796706776438E-2,0,9.724047306176084E-2,1.0950503723171266E-4,3.2851511169513798E-4,6.3512921594393338E-3,0.24113009198423127,0,2.4091108190976785E-3,2.1901007446342531E-4,2.1134472185720544E-2,2.1901007446342531E-4,2.4419623302671924E-2,7.8734121769601401E-2,1.2045554095488392E-3,0,2.9785370127025843E-2,1.0950503723171266E-4,4.3802014892685063E-4,7.6653526062198862E-3,3.2742006132282085E-2,2.1243977222952255E-2,4.8510731493648707E-2,7.6653526062198866E-4,0.13282961016206746,0,0,5.4752518615856327E-4,0,5.0372317126587823E-3]
[]
[{"$f":"'Résultats 1V'!B156:AO157","v":"Canton n° 8"},0,22512,0,10303,12209,202,173,375,9928,863,0,0,30,2355,0,36,2,206,0,205,865,9,0,304,1,2,53,315,160,475,0,1377,0,0,7,0,27]
[0,0,0,0,0.45766702203269366,0.54233297796730628,0,0,3.6397165874017277E-2,0,8.6925866236905722E-2,0,0,3.0217566478646252E-3,0.23720789685737309,0,3.6261079774375505E-3,2.0145044319097501E-4,2.0749395648670427E-2,0,2.0648670427074939E-2,8.7127316680096697E-2,9.0652699435938764E-4,0,3.0620467365028204E-2,1.0072522159548751E-4,2.0145044319097501E-4,5.3384367445608377E-3,3.1728444802578568E-2,1.6116035455278E-2,4.7844480257856564E-2,0,0.1386986301369863,0,0,7.0507655116841257E-4,0,2.7195809830781628E-3]
[]
[]
[{"$f":"'Résultats 1V'!B160:AO161","v":"1ère circonscription"},0,13172,0,7180,5992,129,90,219,6961,402,0,0,23,1918,0,19,2,142,0,166,584,7,0,222,1,3,26,196,99,275,4,894,0,0,5,0,19]
[" de Créteil",0,0,0,0.54509565745520805,0.45490434254479201,0,0,3.0501392757660166E-2,0,5.7750323229421058E-2,0,0,3.3041229708375233E-3,0.2755351242637552,0,2.7294928889527365E-3,2.8731504094239331E-4,2.0399367906909927E-2,0,2.3847148398218648E-2,8.3895991955178856E-2,1.0056026432983766E-3,0,3.1891969544605658E-2,1.4365752047119666E-4,4.3097256141358999E-4,3.7350955322511133E-3,2.8156874012354546E-2,1.4222094526648471E-2,3.9505818129579082E-2,5.7463008188478662E-4,0.12842982330124983,0,0,7.1828760235598331E-4,0,2.7294928889527365E-3]
[]
[{"$f":"'Résultats 1V'!B164:AO165","v":"2ème circonscription"},0,30592,0,12597,17995,265,233,498,12099,1349,1,3,65,2639,0,39,2,257,2,262,1000,13,0,354,1,3,97,418,255,643,3,1696,0,0,7,0,54]
[" de Créteil",0,0,0,0.41177432008368203,0.58822567991631802,0,0,3.9533222195760893E-2,0,0.11149681791883627,8.2651458798247785E-5,2.4795437639474338E-4,5.3723448218861063E-3,0.21811719976857591,0,3.223406893131664E-3,1.6530291759649557E-4,2.1241424911149682E-2,1.6530291759649557E-4,2.165468220514092E-2,8.2651458798247784E-2,1.0744689643772212E-3,0,2.9258616414579719E-2,8.2651458798247785E-5,2.4795437639474338E-4,8.0171915034300354E-3,3.4548309777667575E-2,2.1076121993553187E-2,5.3144888007273329E-2,2.4795437639474338E-4,0.14017687412182825,0,0,5.7856021158773452E-4,0,4.4631787751053809E-3]
[]
[]
[{"$f":"'Résultats 1V'!#REF!","v":{"$error":"#REF!"}},{"$error":"#REF!"},{"$error":"#REF!"},{"$error":"#REF!"},{"$error":"#REF!"},{"$error":"#REF!"},{"$error":"#REF!"},{"$error":"#REF!"},{"$error":"#REF!"},{"$error":"#REF!"},{"$error":"#REF!"},{"$error":"#REF!"},{"$error":"#REF!"},{"$error":"#REF!"},{"$error":"#REF!"},{"$error":"#REF!"},{"$error":"#REF!"},{"$error":"#REF!"},{"$error":"#REF!"},{"$error":"#REF!"},{"$error":"#REF!"},{"$error":"#REF!"},{"$error":"#REF!"},{"$error":"#REF!"},{"$error":"#REF!"},{"$error":"#REF!"},{"$error":"#REF!"},{"$error":"#REF!"},{"$error":"#REF!"},{"$error":"#REF!"},{"$error":"#REF!"},{"$error":"#REF!"},{"$error":"#REF!"},{"$error":"#REF!"},{"$error":"#REF!"},{"$error":"#REF!"},{"$error":"#REF!"},{"$error":"#REF!"}]
[{"$error":"#REF!"},{"$error":"#REF!"},{"$error":"#REF!"},{"$error":"#REF!"},{"$error":"#REF!"},{"$error":"#REF!"},{"$error":"#REF!"},{"$error":"#REF!"},{"$error":"#REF!"},{"$error":"#REF!"},{"$error":"#REF!"},{"$error":"#REF!"},{"$error":"#REF!"},{"$error":"#REF!"},{"$error":"#REF!"},{"$error":"#REF!"},{"$error":"#REF!"},{"$error":"#REF!"},{"$error":"#REF!"},{"$error":"#REF!"},{"$error":"#REF!"},{"$error":"#REF!"},{"$error":"#REF!"},{"$error":"#REF!"},{"$error":"#REF!"},{"$error":"#REF!"},{"$error":"#REF!"},{"$error":"#REF!"},{"$error":"#REF!"},{"$error":"#REF!"},{"$error":"#REF!"},{"$error":"#REF!"},{"$error":"#REF!"},{"$error":"#REF!"},{"$error":"#REF!"},{"$error":"#REF!"},{"$error":"#REF!"},{"$error":"#REF!"}]
[{"$error":"#REF!"},{"$error":"#REF!"},{"$error":"#REF!"},{"$error":"#REF!"},{"$error":"#REF!"},{"$error":"#REF!"},{"$error":"#REF!"},{"$error":"#REF!"},{"$error":"#REF!"},{"$error":"#REF!"},{"$error":"#REF!"},{"$error":"#REF!"},{"$error":"#REF!"},{"$error":"#REF!"},{"$error":"#REF!"},{"$error":"#REF!"},{"$error":"#REF!"},{"$error":"#REF!"},{"$error":"#REF!"},{"$error":"#REF!"},{"$error":"#REF!"},{"$error":"#REF!"},{"$error":"#REF!"},{"$error":"#REF!"},{"$error":"#REF!"},{"$error":"#REF!"},{"$error":"#REF!"},{"$error":"#REF!"},{"$error":"#REF!"},{"$error":"#REF!"},{"$error":"#REF!"},{"$error":"#REF!"},{"$error":"#REF!"},{"$error":"#REF!"},{"$error":"#REF!"},{"$error":"#REF!"},{"$error":"#REF!"},{"$error":"#REF!"}]
[{"$error":"#REF!"},{"$error":"#REF!"},{"$error":"#REF!"},{"$error":"#REF!"},{"$error":"#REF!"},{"$error":"#REF!"},{"$error":"#REF!"},{"$error":"#REF!"},{"$error":"#REF!"},{"$error":"#REF!"},{"$error":"#REF!"},{"$error":"#REF!"},{"$error":"#REF!"},{"$error":"#REF!"},{"$error":"#REF!"},{"$error":"#REF!"},{"$error":"#REF!"},{"$error":"#REF!"},{"$error":"#REF!"},{"$error":"#REF!"},{"$error":"#REF!"},{"$error":"#REF!"},{"$error":"#REF!"},{"$error":"#REF!"},{"$error":"#REF!"},{"$error":"#REF!"},{"$error":"#REF!"},{"$error":"#REF!"},{"$error":"#REF!"},{"$error":"#REF!"},{"$error":"#REF!"},{"$error":"#REF!"},{"$error":"#REF!"},{"$error":"#REF!"},{"$error":"#REF!"},{"$error":"#REF!"},{"$error":"#REF!"},{"$error":"#REF!"}]
[{"$error":"#REF!"},{"$error":"#REF!"},{"$error":"#REF!"},{"$error":"#REF!"},{"$error":"#REF!"},{"$error":"#REF!"},{"$error":"#REF!"},{"$error":"#REF!"},{"$error":"#REF!"},{"$error":"#REF!"},{"$error":"#REF!"},{"$error":"#REF!"},{"$error":"#REF!"},{"$error":"#REF!"},{"$error":"#REF!"},{"$error":"#REF!"},{"$error":"#REF!"},{"$error":"#REF!"},{"$error":"#REF!"},{"$error":"#REF!"},{"$error":"#REF!"},{"$error":"#REF!"},{"$error":"#REF!"},{"$error":"#REF!"},{"$error":"#REF!"},{"$error":"#REF!"},{"$error":"#REF!"},{"$error":"#REF!"},{"$error":"#REF!"},{"$error":"#REF!"},{"$error":"#REF!"},{"$error":"#REF!"},{"$error":"#REF!"},{"$error":"#REF!"},{"$error":"#REF!"},{"$error":"#REF!"},{"$error":"#REF!"},{"$error":"#REF!"}]
[{"$error":"#REF!"},{"$error":"#REF!"},{"$error":"#REF!"},{"$error":"#REF!"},{"$error":"#REF!"},{"$error":"#REF!"},{"$error":"#REF!"},{"$error":"#REF!"},{"$error":"#REF!"},{"$error":"#REF!"},{"$error":"#REF!"},{"$error":"#REF!"},{"$error":"#REF!"},{"$error":"#REF!"},{"$error":"#REF!"},{"$error":"#REF!"},{"$error":"#REF!"},{"$error":"#REF!"},{"$error":"#REF!"},{"$error":"#REF!"},{"$error":"#REF!"},{"$error":"#REF!"},{"$error":"#REF!"},{"$error":"#REF!"},{"$error":"#REF!"},{"$error":"#REF!"},{"$error":"#REF!"},{"$error":"#REF!"},{"$error":"#REF!"},{"$error":"#REF!"},{"$error":"#REF!"},{"$error":"#REF!"},{"$error":"#REF!"},{"$error":"#REF!"},{"$error":"#REF!"},{"$error":"#REF!"},{"$error":"#REF!"},{"$error":"#REF!"}]
[{"$error":"#REF!"},{"$error":"#REF!"},{"$error":"#REF!"},{"$error":"#REF!"},{"$error":"#REF!"},{"$error":"#REF!"},{"$error":"#REF!"},{"$error":"#REF!"},{"$error":"#REF!"},{"$error":"#REF!"},{"$error":"#REF!"},{"$error":"#REF!"},{"$error":"#REF!"},{"$error":"#REF!"},{"$error":"#REF!"},{"$error":"#REF!"},{"$error":"#REF!"},{"$error":"#REF!"},{"$error":"#REF!"},{"$error":"#REF!"},{"$error":"#REF!"},{"$error":"#REF!"},{"$error":"#REF!"},{"$error":"#REF!"},{"$error":"#REF!"},{"$error":"#REF!"},{"$error":"#REF!"},{"$error":"#REF!"},{"$error":"#REF!"},{"$error":"#REF!"},{"$error":"#REF!"},{"$error":"#REF!"},{"$error":"#REF!"},{"$error":"#REF!"},{"$error":"#REF!"},{"$error":"#REF!"},{"$error":"#REF!"},{"$error":"#REF!"}]
[{"$error":"#REF!"},{"$error":"#REF!"},{"$error":"#REF!"},{"$error":"#REF!"},{"$error":"#REF!"},{"$error":"#REF!"},{"$error":"#REF!"},{"$error":"#REF!"},{"$error":"#REF!"},{"$error":"#REF!"},{"$error":"#REF!"},{"$error":"#REF!"},{"$error":"#REF!"},{"$error":"#REF!"},{"$error":"#REF!"},{"$error":"#REF!"},{"$error":"#REF!"},{"$error":"#REF!"},{"$error":"#REF!"},{"$error":"#REF!"},{"$error":"#REF!"},{"$error":"#REF!"},{"$error":"#REF!"},{"$error":"#REF!"},{"$error":"#REF!"},{"$error":"#REF!"},{"$error":"#REF!"},{"$error":"#REF!"},{"$error":"#REF!"},{"$error":"#REF!"},{"$error":"#REF!"},{"$error":"#REF!"},{"$error":"#REF!"},{"$error":"#REF!"},{"$error":"#REF!"},{"$error":"#REF!"},{"$error":"#REF!"},{"$error":"#REF!"}]
[{"$error":"#REF!"},{"$error":"#REF!"},{"$error":"#REF!"},{"$error":"#REF!"},{"$error":"#REF!"},{"$error":"#REF!"},{"$error":"#REF!"},{"$error":"#REF!"},{"$error":"#REF!"},{"$error":"#REF!"},{"$error":"#REF!"},{"$error":"#REF!"},{"$error":"#REF!"},{"$error":"#REF!"},{"$error":"#REF!"},{"$error":"#REF!"},{"$error":"#REF!"},{"$error":"#REF!"},{"$error":"#REF!"},{"$error":"#REF!"},{"$error":"#REF!"},{"$error":"#REF!"},{"$error":"#REF!"},{"$error":"#REF!"},{"$error":"#REF!"},{"$error":"#REF!"},{"$error":"#REF!"},{"$error":"#REF!"},{"$error":"#REF!"},{"$error":"#REF!"},{"$error":"#REF!"},{"$error":"#REF!"},{"$error":"#REF!"},{"$error":"#REF!"},{"$error":"#REF!"},{"$error":"#REF!"},{"$error":"#REF!"},{"$error":"#REF!"}]
[{"$error":"#REF!"},{"$error":"#REF!"},{"$error":"#REF!"},{"$error":"#REF!"},{"$error":"#REF!"},{"$error":"#REF!"},{"$error":"#REF!"},{"$error":"#REF!"},{"$error":"#REF!"},{"$error":"#REF!"},{"$error":"#REF!"},{"$error":"#REF!"},{"$error":"#REF!"},{"$error":"#REF!"},{"$error":"#REF!"},{"$error":"#REF!"},{"$error":"#REF!"},{"$error":"#REF!"},{"$error":"#REF!"},{"$error":"#REF!"},{"$error":"#REF!"},{"$error":"#REF!"},{"$error":"#REF!"},{"$error":"#REF!"},{"$error":"#REF!"},{"$error":"#REF!"},{"$error":"#REF!"},{"$error":"#REF!"},{"$error":"#REF!"},{"$error":"#REF!"},{"$error":"#REF!"},{"$error":"#REF!"},{"$error":"#REF!"},{"$error":"#REF!"},{"$error":"#REF!"},{"$error":"#REF!"},{"$error":"#REF!"},{"$error":"#REF!"}]
[{"$error":"#REF!"},{"$error":"#REF!"},{"$error":"#REF!"},{"$error":"#REF!"},{"$error":"#REF!"},{"$error":"#REF!"},{"$error":"#REF!"},{"$error":"#REF!"},{"$error":"#REF!"},{"$error":"#REF!"},{"$error":"#REF!"},{"$error":"#REF!"},{"$error":"#REF!"},{"$error":"#REF!"},{"$error":"#REF!"},{"$error":"#REF!"},{"$error":"#REF!"},{"$error":"#REF!"},{"$error":"#REF!"},{"$error":"#REF!"},{"$error":"#REF!"},{"$error":"#REF!"},{"$error":"#REF!"},{"$error":"#REF!"},{"$error":"#REF!"},{"$error":"#REF!"},{"$error":"#REF!"},{"$error":"#REF!"},{"$error":"#REF!"},{"$error":"#REF!"},{"$error":"#REF!"},{"$error":"#REF!"},{"$error":"#REF!"},{"$error":"#REF!"},{"$error":"#REF!"},{"$error":"#REF!"},{"$error":"#REF!"},{"$error":"#REF!"}]
[{"$error":"#REF!"},{"$error":"#REF!"},{"$error":"#REF!"},{"$error":"#REF!"},{"$error":"#REF!"},{"$error":"#REF!"},{"$error":"#REF!"},{"$error":"#REF!"},{"$error":"#REF!"},{"$error":"#REF!"},{"$error":"#REF!"},{"$error":"#REF!"},{"$error":"#REF!"},{"$error":"#REF!"},{"$error":"#REF!"},{"$error":"#REF!"},{"$error":"#REF!"},{"$error":"#REF!"},{"$error":"#REF!"},{"$error":"#REF!"},{"$error":"#REF!"},{"$error":"#REF!"},{"$error":"#REF!"},{"$error":"#REF!"},{"$error":"#REF!"},{"$error":"#REF!"},{"$error":"#REF!"},{"$error":"#REF!"},{"$error":"#REF!"},{"$error":"#REF!"},{"$error":"#REF!"},{"$error":"#REF!"},{"$error":"#REF!"},{"$error":"#REF!"},{"$error":"#REF!"},{"$error":"#REF!"},{"$error":"#REF!"},{"$error":"#REF!"}]
[{"$error":"#REF!"},{"$error":"#REF!"},{"$error":"#REF!"},{"$error":"#REF!"},{"$error":"#REF!"},{"$error":"#REF!"},{"$error":"#REF!"},{"$error":"#REF!"},{"$error":"#REF!"},{"$error":"#REF!"},{"$error":"#REF!"},{"$error":"#REF!"},{"$error":"#REF!"},{"$error":"#REF!"},{"$error":"#REF!"},{"$error":"#REF!"},{"$error":"#REF!"},{"$error":"#REF!"},{"$error":"#REF!"},{"$error":"#REF!"},{"$error":"#REF!"},{"$error":"#REF!"},{"$error":"#REF!"},{"$error":"#REF!"},{"$error":"#REF!"},{"$error":"#REF!"},{"$error":"#REF!"},{"$error":"#REF!"},{"$error":"#REF!"},{"$error":"#REF!"},{"$error":"#REF!"},{"$error":"#REF!"},{"$error":"#REF!"},{"$error":"#REF!"},{"$error":"#REF!"},{"$error":"#REF!"},{"$error":"#REF!"},{"$error":"#REF!"}]
[{"$error":"#REF!"},{"$error":"#REF!"},{"$error":"#REF!"},{"$error":"#REF!"},{"$error":"#REF!"},{"$error":"#REF!"},{"$error":"#REF!"},{"$error":"#REF!"},{"$error":"#REF!"},{"$error":"#REF!"},{"$error":"#REF!"},{"$error":"#REF!"},{"$error":"#REF!"},{"$error":"#REF!"},{"$error":"#REF!"},{"$error":"#REF!"},{"$error":"#REF!"},{"$error":"#REF!"},{"$error":"#REF!"},{"$error":"#REF!"},{"$error":"#REF!"},{"$error":"#REF!"},{"$error":"#REF!"},{"$error":"#REF!"},{"$error":"#REF!"},{"$error":"#REF!"},{"$error":"#REF!"},{"$error":"#REF!"},{"$error":"#REF!"},{"$error":"#REF!"},{"$error":"#REF!"},{"$error":"#REF!"},{"$error":"#REF!"},{"$error":"#REF!"},{"$error":"#REF!"},{"$error":"#REF!"},{"$error":"#REF!"},{"$error":"#REF!"}]
[{"$error":"#REF!"},{"$error":"#REF!"},{"$error":"#REF!"},{"$error":"#REF!"},{"$error":"#REF!"},{"$error":"#REF!"},{"$error":"#REF!"},{"$error":"#REF!"},{"$error":"#REF!"},{"$error":"#REF!"},{"$error":"#REF!"},{"$error":"#REF!"},{"$error":"#REF!"},{"$error":"#REF!"},{"$error":"#REF!"},{"$error":"#REF!"},{"$error":"#REF!"},{"$error":"#REF!"},{"$error":"#REF!"},{"$error":"#REF!"},{"$error":"#REF!"},{"$error":"#REF!"},{"$error":"#REF!"},{"$error":"#REF!"},{"$error":"#REF!"},{"$error":"#REF!"},{"$error":"#REF!"},{"$error":"#REF!"},{"$error":"#REF!"},{"$error":"#REF!"},{"$error":"#REF!"},{"$error":"#REF!"},{"$error":"#REF!"},{"$error":"#REF!"},{"$error":"#REF!"},{"$error":"#REF!"},{"$error":"#REF!"},{"$error":"#REF!"}]
[{"$error":"#REF!"},{"$error":"#REF!"},{"$error":"#REF!"},{"$error":"#REF!"},{"$error":"#REF!"},{"$error":"#REF!"},{"$error":"#REF!"},{"$error":"#REF!"},{"$error":"#REF!"},{"$error":"#REF!"},{"$error":"#REF!"},{"$error":"#REF!"},{"$error":"#REF!"},{"$error":"#REF!"},{"$error":"#REF!"},{"$error":"#REF!"},{"$error":"#REF!"},{"$error":"#REF!"},{"$error":"#REF!"},{"$error":"#REF!"},{"$error":"#REF!"},{"$error":"#REF!"},{"$error":"#REF!"},{"$error":"#REF!"},{"$error":"#REF!"},{"$error":"#REF!"},{"$error":"#REF!"},{"$error":"#REF!"},{"$error":"#REF!"},{"$error":"#REF!"},{"$error":"#REF!"},{"$error":"#REF!"},{"$error":"#REF!"},{"$error":"#REF!"},{"$error":"#REF!"},{"$error":"#REF!"},{"$error":"#REF!"},{"$error":"#REF!"}]
[{"$error":"#REF!"},{"$error":"#REF!"},{"$error":"#REF!"},{"$error":"#REF!"},{"$error":"#REF!"},{"$error":"#REF!"},{"$error":"#REF!"},{"$error":"#REF!"},{"$error":"#REF!"},{"$error":"#REF!"},{"$error":"#REF!"},{"$error":"#REF!"},{"$error":"#REF!"},{"$error":"#REF!"},{"$error":"#REF!"},{"$error":"#REF!"},{"$error":"#REF!"},{"$error":"#REF!"},{"$error":"#REF!"},{"$error":"#REF!"},{"$error":"#REF!"},{"$error":"#REF!"},{"$error":"#REF!"},{"$error":"#REF!"},{"$error":"#REF!"},{"$error":"#REF!"},{"$error":"#REF!"},{"$error":"#REF!"},{"$error":"#REF!"},{"$error":"#REF!"},{"$error":"#REF!"},{"$error":"#REF!"},{"$error":"#REF!"},{"$error":"#REF!"},{"$error":"#REF!"},{"$error":"#REF!"},{"$error":"#REF!"},{"$error":"#REF!"}]
[{"$error":"#REF!"},{"$error":"#REF!"},{"$error":"#REF!"},{"$error":"#REF!"},{"$error":"#REF!"},{"$error":"#REF!"},{"$error":"#REF!"},{"$error":"#REF!"},{"$error":"#REF!"},{"$error":"#REF!"},{"$error":"#REF!"},{"$error":"#REF!"},{"$error":"#REF!"},{"$error":"#REF!"},{"$error":"#REF!"},{"$error":"#REF!"},{"$error":"#REF!"},{"$error":"#REF!"},{"$error":"#REF!"},{"$error":"#REF!"},{"$error":"#REF!"},{"$error":"#REF!"},{"$error":"#REF!"},{"$error":"#REF!"},{"$error":"#REF!"},{"$error":"#REF!"},{"$error":"#REF!"},{"$error":"#REF!"},{"$error":"#REF!"},{"$error":"#REF!"},{"$error":"#REF!"},{"$error":"#REF!"},{"$error":"#REF!"},{"$error":"#REF!"},{"$error":"#REF!"},{"$error":"#REF!"},{"$error":"#REF!"},{"$error":"#REF!"}]
[{"$error":"#REF!"},{"$error":"#REF!"},{"$error":"#REF!"},{"$error":"#REF!"},{"$error":"#REF!"},{"$error":"#REF!"},{"$error":"#REF!"},{"$error":"#REF!"},{"$error":"#REF!"},{"$error":"#REF!"},{"$error":"#REF!"},{"$error":"#REF!"},{"$error":"#REF!"},{"$error":"#REF!"},{"$error":"#REF!"},{"$error":"#REF!"},{"$error":"#REF!"},{"$error":"#REF!"},{"$error":"#REF!"},{"$error":"#REF!"},{"$error":"#REF!"},{"$error":"#REF!"},{"$error":"#REF!"},{"$error":"#REF!"},{"$error":"#REF!"},{"$error":"#REF!"},{"$error":"#REF!"},{"$error":"#REF!"},{"$error":"#REF!"},{"$error":"#REF!"},{"$error":"#REF!"},{"$error":"#REF!"},{"$error":"#REF!"},{"$error":"#REF!"},{"$error":"#REF!"},{"$error":"#REF!"},{"$error":"#REF!"},{"$error":"#REF!"}]
[{"$error":"#REF!"},{"$error":"#REF!"},{"$error":"#REF!"},{"$error":"#REF!"},{"$error":"#REF!"},{"$error":"#REF!"},{"$error":"#REF!"},{"$error":"#REF!"},{"$error":"#REF!"},{"$error":"#REF!"},{"$error":"#REF!"},{"$error":"#REF!"},{"$error":"#REF!"},{"$error":"#REF!"},{"$error":"#REF!"},{"$error":"#REF!"},{"$error":"#REF!"},{"$error":"#REF!"},{"$error":"#REF!"},{"$error":"#REF!"},{"$error":"#REF!"},{"$error":"#REF!"},{"$error":"#REF!"},{"$error":"#REF!"},{"$error":"#REF!"},{"$error":"#REF!"},{"$error":"#REF!"},{"$error":"#REF!"},{"$error":"#REF!"},{"$error":"#REF!"},{"$error":"#REF!"},{"$error":"#REF!"},{"$error":"#REF!"},{"$error":"#REF!"},{"$error":"#REF!"},{"$error":"#REF!"},{"$error":"#REF!"},{"$error":"#REF!"}]
[{"$error":"#REF!"},{"$error":"#REF!"},{"$error":"#REF!"},{"$error":"#REF!"},{"$error":"#REF!"},{"$error":"#REF!"},{"$error":"#REF!"},{"$error":"#REF!"},{"$error":"#REF!"},{"$error":"#REF!"},{"$error":"#REF!"},{"$error":"#REF!"},{"$error":"#REF!"},{"$error":"#REF!"},{"$error":"#REF!"},{"$error":"#REF!"},{"$error":"#REF!"},{"$error":"#REF!"},{"$error":"#REF!"},{"$error":"#REF!"},{"$error":"#REF!"},{"$error":"#REF!"},{"$error":"#REF!"},{"$error":"#REF!"},{"$error":"#REF!"},{"$error":"#REF!"},{"$error":"#REF!"},{"$error":"#REF!"},{"$error":"#REF!"},{"$error":"#REF!"},{"$error":"#REF!"},{"$error":"#REF!"},{"$error":"#REF!"},{"$error":"#REF!"},{"$error":"#REF!"},{"$error":"#REF!"},{"$error":"#REF!"},{"$error":"#REF!"}]
[{"$error":"#REF!"},{"$error":"#REF!"},{"$error":"#REF!"},{"$error":"#REF!"},{"$error":"#REF!"},{"$error":"#REF!"},{"$error":"#REF!"},{"$error":"#REF!"},{"$error":"#REF!"},{"$error":"#REF!"},{"$error":"#REF!"},{"$error":"#REF!"},{"$error":"#REF!"},{"$error":"#REF!"},{"$error":"#REF!"},{"$error":"#REF!"},{"$error":"#REF!"},{"$error":"#REF!"},{"$error":"#REF!"},{"$error":"#REF!"},{"$error":"#REF!"},{"$error":"#REF!"},{"$error":"#REF!"},{"$error":"#REF!"},{"$error":"#REF!"},{"$error":"#REF!"},{"$error":"#REF!"},{"$error":"#REF!"},{"$error":"#REF!"},{"$error":"#REF!"},{"$error":"#REF!"},{"$error":"#REF!"},{"$error":"#REF!"},{"$error":"#REF!"},{"$error":"#REF!"},{"$error":"#REF!"},{"$error":"#REF!"},{"$error":"#REF!"}]
[{"$error":"#REF!"},{"$error":"#REF!"},{"$error":"#REF!"},{"$error":"#REF!"},{"$error":"#REF!"},{"$error":"#REF!"},{"$error":"#REF!"},{"$error":"#REF!"},{"$error":"#REF!"},{"$error":"#REF!"},{"$error":"#REF!"},{"$error":"#REF!"},{"$error":"#REF!"},{"$error":"#REF!"},{"$error":"#REF!"},{"$error":"#REF!"},{"$error":"#REF!"},{"$error":"#REF!"},{"$error":"#REF!"},{"$error":"#REF!"},{"$error":"#REF!"},{"$error":"#REF!"},{"$error":"#REF!"},{"$error":"#REF!"},{"$error":"#REF!"},{"$error":"#REF!"},{"$error":"#REF!"},{"$error":"#REF!"},{"$error":"#REF!"},{"$error":"#REF!"},{"$error":"#REF!"},{"$error":"#REF!"},{"$error":"#REF!"},{"$error":"#REF!"},{"$error":"#REF!"},{"$error":"#REF!"},{"$error":"#REF!"},{"$error":"#REF!"}]
[{"$error":"#REF!"},{"$error":"#REF!"},{"$error":"#REF!"},{"$error":"#REF!"},{"$error":"#REF!"},{"$error":"#REF!"},{"$error":"#REF!"},{"$error":"#REF!"},{"$error":"#REF!"},{"$error":"#REF!"},{"$error":"#REF!"},{"$error":"#REF!"},{"$error":"#REF!"},{"$error":"#REF!"},{"$error":"#REF!"},{"$error":"#REF!"},{"$error":"#REF!"},{"$error":"#REF!"},{"$error":"#REF!"},{"$error":"#REF!"},{"$error":"#REF!"},{"$error":"#REF!"},{"$error":"#REF!"},{"$error":"#REF!"},{"$error":"#REF!"},{"$error":"#REF!"},{"$error":"#REF!"},{"$error":"#REF!"},{"$error":"#REF!"},{"$error":"#REF!"},{"$error":"#REF!"},{"$error":"#REF!"},{"$error":"#REF!"},{"$error":"#REF!"},{"$error":"#REF!"},{"$error":"#REF!"},{"$error":"#REF!"},{"$error":"#REF!"}]
[{"$error":"#REF!"},{"$error":"#REF!"},{"$error":"#REF!"},{"$error":"#REF!"},{"$error":"#REF!"},{"$error":"#REF!"},{"$error":"#REF!"},{"$error":"#REF!"},{"$error":"#REF!"},{"$error":"#REF!"},{"$error":"#REF!"},{"$error":"#REF!"},{"$error":"#REF!"},{"$error":"#REF!"},{"$error":"#REF!"},{"$error":"#REF!"},{"$error":"#REF!"},{"$error":"#REF!"},{"$error":"#REF!"},{"$error":"#REF!"},{"$error":"#REF!"},{"$error":"#REF!"},{"$error":"#REF!"},{"$error":"#REF!"},{"$error":"#REF!"},{"$error":"#REF!"},{"$error":"#REF!"},{"$error":"#REF!"},{"$error":"#REF!"},{"$error":"#REF!"},{"$error":"#REF!"},{"$error":"#REF!"},{"$error":"#REF!"},{"$error":"#REF!"},{"$error":"#REF!"},{"$error":"#REF!"},{"$error":"#REF!"},{"$error":"#REF!"}]
[{"$error":"#REF!"},{"$error":"#REF!"},{"$error":"#REF!"},{"$error":"#REF!"},{"$error":"#REF!"},{"$error":"#REF!"},{"$error":"#REF!"},{"$error":"#REF!"},{"$error":"#REF!"},{"$error":"#REF!"},{"$error":"#REF!"},{"$error":"#REF!"},{"$error":"#REF!"},{"$error":"#REF!"},{"$error":"#REF!"},{"$error":"#REF!"},{"$error":"#REF!"},{"$error":"#REF!"},{"$error":"#REF!"},{"$error":"#REF!"},{"$error":"#REF!"},{"$error":"#REF!"},{"$error":"#REF!"},{"$error":"#REF!"},{"$error":"#REF!"},{"$error":"#REF!"},{"$error":"#REF!"},{"$error":"#REF!"},{"$error":"#REF!"},{"$error":"#REF!"},{"$error":"#REF!"},{"$error":"#REF!"},{"$error":"#REF!"},{"$error":"#REF!"},{"$error":"#REF!"},{"$error":"#REF!"},{"$error":"#REF!"},{"$error":"#REF!"}]
[{"$error":"#REF!"},{"$error":"#REF!"},{"$error":"#REF!"},{"$error":"#REF!"},{"$error":"#REF!"},{"$error":"#REF!"},{"$error":"#REF!"},{"$error":"#REF!"},{"$error":"#REF!"},{"$error":"#REF!"},{"$error":"#REF!"},{"$error":"#REF!"},{"$error":"#REF!"},{"$error":"#REF!"},{"$error":"#REF!"},{"$error":"#REF!"},{"$error":"#REF!"},{"$error":"#REF!"},{"$error":"#REF!"},{"$error":"#REF!"},{"$error":"#REF!"},{"$error":"#REF!"},{"$error":"#REF!"},{"$error":"#REF!"},{"$error":"#REF!"},{"$error":"#REF!"},{"$error":"#REF!"},{"$error":"#REF!"},{"$error":"#REF!"},{"$error":"#REF!"},{"$error":"#REF!"},{"$error":"#REF!"},{"$error":"#REF!"},{"$error":"#REF!"},{"$error":"#REF!"},{"$error":"#REF!"},{"$error":"#REF!"},{"$error":"#REF!"}]
[{"$error":"#REF!"},{"$error":"#REF!"},{"$error":"#REF!"},{"$error":"#REF!"},{"$error":"#REF!"},{"$error":"#REF!"},{"$error":"#REF!"},{"$error":"#REF!"},{"$error":"#REF!"},{"$error":"#REF!"},{"$error":"#REF!"},{"$error":"#REF!"},{"$error":"#REF!"},{"$error":"#REF!"},{"$error":"#REF!"},{"$error":"#REF!"},{"$error":"#REF!"},{"$error":"#REF!"},{"$error":"#REF!"},{"$error":"#REF!"},{"$error":"#REF!"},{"$error":"#REF!"},{"$error":"#REF!"},{"$error":"#REF!"},{"$error":"#REF!"},{"$error":"#REF!"},{"$error":"#REF!"},{"$error":"#REF!"},{"$error":"#REF!"},{"$error":"#REF!"},{"$error":"#REF!"},{"$error":"#REF!"},{"$error":"#REF!"},{"$error":"#REF!"},{"$error":"#REF!"},{"$error":"#REF!"},{"$error":"#REF!"},{"$error":"#REF!"}]
[{"$error":"#REF!"},{"$error":"#REF!"},{"$error":"#REF!"},{"$error":"#REF!"},{"$error":"#REF!"},{"$error":"#REF!"},{"$error":"#REF!"},{"$error":"#REF!"},{"$error":"#REF!"},{"$error":"#REF!"},{"$error":"#REF!"},{"$error":"#REF!"},{"$error":"#REF!"},{"$error":"#REF!"},{"$error":"#REF!"},{"$error":"#REF!"},{"$error":"#REF!"},{"$error":"#REF!"},{"$error":"#REF!"},{"$error":"#REF!"},{"$error":"#REF!"},{"$error":"#REF!"},{"$error":"#REF!"},{"$error":"#REF!"},{"$error":"#REF!"},{"$error":"#REF!"},{"$error":"#REF!"},{"$error":"#REF!"},{"$error":"#REF!"},{"$error":"#REF!"},{"$error":"#REF!"},{"$error":"#REF!"},{"$error":"#REF!"},{"$error":"#REF!"},{"$error":"#REF!"},{"$error":"#REF!"},{"$error":"#REF!"},{"$error":"#REF!"}]
[{"$error":"#REF!"},{"$error":"#REF!"},{"$error":"#REF!"},{"$error":"#REF!"},{"$error":"#REF!"},{"$error":"#REF!"},{"$error":"#REF!"},{"$error":"#REF!"},{"$error":"#REF!"},{"$error":"#REF!"},{"$error":"#REF!"},{"$error":"#REF!"},{"$error":"#REF!"},{"$error":"#REF!"},{"$error":"#REF!"},{"$error":"#REF!"},{"$error":"#REF!"},{"$error":"#REF!"},{"$error":"#REF!"},{"$error":"#REF!"},{"$error":"#REF!"},{"$error":"#REF!"},{"$error":"#REF!"},{"$error":"#REF!"},{"$error":"#REF!"},{"$error":"#REF!"},{"$error":"#REF!"},{"$error":"#REF!"},{"$error":"#REF!"},{"$error":"#REF!"},{"$error":"#REF!"},{"$error":"#REF!"},{"$error":"#REF!"},{"$error":"#REF!"},{"$error":"#REF!"},{"$error":"#REF!"},{"$error":"#REF!"},{"$error":"#REF!"}]
[{"$error":"#REF!"},{"$error":"#REF!"},{"$error":"#REF!"},{"$error":"#REF!"},{"$error":"#REF!"},{"$error":"#REF!"},{"$error":"#REF!"},{"$error":"#REF!"},{"$error":"#REF!"},{"$error":"#REF!"},{"$error":"#REF!"},{"$error":"#REF!"},{"$error":"#REF!"},{"$error":"#REF!"},{"$error":"#REF!"},{"$error":"#REF!"},{"$error":"#REF!"},{"$error":"#REF!"},{"$error":"#REF!"},{"$error":"#REF!"},{"$error":"#REF!"},{"$error":"#REF!"},{"$error":"#REF!"},{"$error":"#REF!"},{"$error":"#REF!"},{"$error":"#REF!"},{"$error":"#REF!"},{"$error":"#REF!"},{"$error":"#REF!"},{"$error":"#REF!"},{"$error":"#REF!"},{"$error":"#REF!"},{"$error":"#REF!"},{"$error":"#REF!"},{"$error":"#REF!"},{"$error":"#REF!"},{"$error":"#REF!"},{"$error":"#REF!"}]
[]
[]
[{"$f":"'Résultats 1V'!B168:AO169","v":"1ère circonscription"},0,13172,0,7180,5992,129,90,219,6961,402,0,0,23,1918,0,319,2,142,0,166,584,7,0,222,1,3,26,196,99,275,4,894,0,0,5,0,19]
["du Val de Marne",0,0,0,0.54509565745520805,0.45490434254479201,0,0,3.0501392757660166E-2,0,5.7750323229421058E-2,0,0,3.3041229708375233E-3,0.2755351242637552,0,4.5826749030311739E-2,2.8731504094239331E-4,2.0399367906909927E-2,0,2.3847148398218648E-2,8.3895991955178856E-2,1.0056026432983766E-3,0,3.1891969544605658E-2,1.4365752047119666E-4,4.3097256141358999E-4,3.7350955322511133E-3,2.8156874012354546E-2,1.4222094526648471E-2,3.9505818129579082E-2,5.7463008188478662E-4,0.12842982330124983,0,0,7.1828760235598331E-4,0,2.7294928889527365E-3]
[]
[{"$f":"'Résultats 1V'!B172:AO173","v":"2ème circonscription"},0,30592,0,12597,17995,265,233,498,12099,1349,1,3,65,2639,0,139,2,257,2,262,1000,13,0,354,1,3,97,418,255,643,3,1696,0,0,7,0,54]
["du Val de Marne",0,0,0,0.41177432008368203,0.58822567991631802,0,0,3.9533222195760893E-2,0,0.11149681791883627,8.2651458798247785E-5,2.4795437639474338E-4,5.3723448218861063E-3,0.21811719976857591,0,1.1488552772956443E-2,1.6530291759649557E-4,2.1241424911149682E-2,1.6530291759649557E-4,2.165468220514092E-2,8.2651458798247784E-2,1.0744689643772212E-3,0,2.9258616414579719E-2,8.2651458798247785E-5,2.4795437639474338E-4,8.0171915034300354E-3,3.4548309777667575E-2,2.1076121993553187E-2,5.3144888007273329E-2,2.4795437639474338E-4,0.14017687412182825,0,0,5.7856021158773452E-4,0,4.4631787751053809E-3]

{"sheet":"M14-CONSEIL1","index":5,"n_rows":75,"n_cols":20,"rows_kept":75,"cut":false,"hidden":true,"merged":[[11,17,11,19],[66,0,66,7],[68,0,68,7]]}
[]
[]
["exprimés :",{"$f":"'Résultats 1V'!K143","v":19060}]
["élégibilité :",{"$f":"ROUND(('Résultats 1V'!K143)*0.05,0)","v":953}]
["suffrages exprimés utiles",{"$f":"SUM($E$13:$E$22)","v":6308}]
["quotient électoral",{"$f":"(($B$5)/$G$12)","v":242.61538461538461}]
[]
[]
[]
[null,null,"suffrages exprimés","% des suffrages exprimés","suffrages utiles","sièges attribués à la majorité","sièges attribuables à la proportionnelle","plus forte moyenne 1ère attribution","sièges attribués à la plus forte moyenne 1ère attribution","plus forte moyenne 2ème attribution","sièges attribués à la plus forte moyenne 2ème attribution","plus forte moyenne 3ème attribution","sièges attribués à la plus forte moyenne 3ème attribution","plus forte moyenne 4ème attribution","sièges attribués à la plus forte moyenne 4ème attribution","TOTAL DES SIEGES ATTRIBUES"]
[null,null,null,null,null,"S1","S2","M3","S3","M4","S4","M5","S5","M6","S6"]
["sièges à répartir ",53,null,null,null,{"$f":"ROUND($B$12/2,0)","v":27},{"$f":"($B$12-$F$12)","v":26},null,null,null,null,null,null,null,null,null,null,"TRI par tendance politique\nde xgauche (1) à xdroite (n)"]
[{"$f":"'Résultats 1V'!L5","v":"FRANCE INSOUMISE conduite par\nM. AUBRY"},null,{"$f":"'Résultats 1V'!L143","v":1751},{"$f":"'Résultats 1V'!L144","v":9.1867785939139565E-2},{"$f":"IF(((C13)<($B$4)),0,C13)","v":1751},{"$f":"IF(((C13)=MAX($C$13:$C$22)),$F$12,0)","v":0},{"$f":"INT(E13/$B$6)","v":7},{"$f":"IF(SUM($F$12,$G$13:$G$22)=$B$12,0,((E13)/(G13+1)))","v":218.875},{"$f":"IF(AND((H13>0),((H13)=MAX($H$13:$H$22))),1,0)","v":0},{"$f":"IF(SUM($F$12,$G$13:$G$22,$I$13:$I$22)=$B$12,0,((E13)/((G13+I13)+1)))","v":0},{"$f":"IF(AND((J13>0),((J13)=MAX($J$13:$J$22))),1,0)","v":0},{"$f":"IF(SUM($F$12,$G$13:$G$22,$I$13:$I$22,$K$13:$K$22)=$B$12,0,((E13)/((G13+I13+K13)+1)))","v":0},{"$f":"IF(AND((L13>0),((L13)=MAX($L$13:$L$22))),1,0)","v":0},{"$f":"IF(SUM($F$12,$G$13:$G$22,$I$13:$I$22,$K$13:$K$22,$M$13:$M$22)=$B$12,0,((E13)/((G13+I13+K13+M13)+1)))","v":0},{"$f":"IF(AND((N13>0),((N13)=MAX($N$13:$N$22))),1,0)","v":0},{"$f":"SUM(F13+G13+I13+K13+M13+O13)","v":7},{"$f":"A13","v":"FRANCE INSOUMISE conduite par\nM. AUBRY"},3,"Ecolo","EELV"]
[{"$f":"'Résultats 1V'!M5","v":"FRANCE ROYALE conduite par \nR. de PREVOISIN"},null,{"$f":"'Résultats 1V'!M143","v":1},{"$f":"'Résultats 1V'!M144","v":5.246589716684155E-5},{"$f":"IF(((C14)<($B$4)),0,C14)","v":0},{"$f":"IF(((C14)=MAX($C$13:$C$22)),$F$12,0)","v":0},{"$f":"INT(E14/$B$6)","v":0},{"$f":"IF(SUM($F$12,$G$13:$G$22)=$B$12,0,((E14)/(G14+1)))","v":0},{"$f":"IF(AND((H14>0),((H14)=MAX($H$13:$H$22))),1,0)","v":0},{"$f":"IF(SUM($F$12,$G$13:$G$22,$I$13:$I$22)=$B$12,0,((E14)/((G14+I14)+1)))","v":0},{"$f":"IF(AND((J14>0),((J14)=MAX($J$13:$J$22))),1,0)","v":0},{"$f":"IF(SUM($F$12,$G$13:$G$22,$I$13:$I$22,$K$13:$K$22)=$B$12,0,((E14)/((G14+I14+K14)+1)))","v":0},{"$f":"IF(AND((L14>0),((L14)=MAX($L$13:$L$22))),1,0)","v":0},{"$f":"IF(SUM($F$12,$G$13:$G$22,$I$13:$I$22,$K$13:$K$22,$M$13:$M$22)=$B$12,0,((E14)/((G14+I14+K14+M14)+1)))","v":0},0,{"$f":"SUM(F14+G14+I14+K14+M14+O14)","v":0},{"$f":"A14","v":"FRANCE ROYALE conduite par \nR. de PREVOISIN"},8,"XD","FN"]
[{"$f":"'Résultats 1V'!N5","v":"LIGNE CLAIRE conduite par\nR. CAMUS"},null,{"$f":"'Résultats 1V'!N143","v":3},{"$f":"'Résultats 1V'!N144","v":1.5739769150052466E-4},0,0,0,{"$f":"IF(SUM($F$12,$G$13:$G$22)=$B$12,0,((E15)/(G15+1)))","v":0},{"$f":"IF(AND((H15>0),((H15)=MAX($H$13:$H$22))),1,0)","v":0},0,0,0,0,{"$f":"IF(SUM($F$12,$G$13:$G$22,$I$13:$I$22,$K$13:$K$22,$M$13:$M$22)=$B$12,0,((E15)/((G15+I15+K15+M15)+1)))","v":0},0,0,"LIGNE CLAIRE conduite par\nR. CAMUS",1,"XG","LO"]
[{"$f":"'Résultats 1V'!O5","v":"PARTI PIRATE conduite par \nF. MARIE"},null,{"$f":"'Résultats 1V'!O143","v":88},{"$f":"'Résultats 1V'!O144","v":4.6169989506820563E-3},0,0,0,0,0,0,0,0,0,0,0,0,"PARTI PIRATE conduite par \nF. MARIE",4,"Autre"]
[{"$f":"'Résultats 1V'!P5","v":"RÉPUBLIQUE EN MARCHE conduite par \nN. LOISEAU"},null,{"$f":"'Résultats 1V'!P143","v":4557},{"$f":"'Résultats 1V'!P144","v":0.23908709338929696},4557,27,18,239.84210526315789,1,0,0,0,0,0,0,46,"RÉPUBLIQUE EN MARCHE conduite par \nN. LOISEAU",5,"D"]
[{"$f":"'Résultats 1V'!Q5","v":"DÉMOCRATIE RÉPRESENTATIVE conduite par \nH. TRAORE"},null,{"$f":"'Résultats 1V'!Q143","v":0},{"$f":"'Résultats 1V'!Q144","v":0},0,0,0,0,0,0,0,0,0,0,0,0,"DÉMOCRATIE RÉPRESENTATIVE conduite par \nH. TRAORE",6,"D","UMP"]
[{"$f":"'Résultats 1V'!R5","v":"PATRIOTES ET GILETS JAUNES conduite par \nF. PHILIPPOT"},null,{"$f":"'Résultats 1V'!R143","v":58},{"$f":"'Résultats 1V'!R144","v":3.0430220356768099E-3},0,0,0,0,0,0,0,0,0,0,0,0,"PATRIOTES ET GILETS JAUNES conduite par \nF. PHILIPPOT",7,"D","Modem"]
[{"$f":"'Résultats 1V'!S5","v":"PACE conduite par \nA. ALEXANDRE"},null,{"$f":"'Résultats 1V'!S143","v":4},{"$f":"'Résultats 1V'!S144","v":2.098635886673662E-4},{"$f":"IF(((C20)<($B$4)),0,C20)","v":0},0,0,0,0,0,0,0,0,0,0,0,"PACE conduite par \nA. ALEXANDRE",2,"G","PS"]
[0,null,0,0,0,0,0,0,0,0,0,0,0,0,0,0,0]
[0,null,0,0,0,0,0,0,0,0,0,{"$f":"IF(SUM($F$12,$G$13:$G$22,$I$13:$I$22,$K$13:$K$22)=$B$12,0,((E22)/((G22+I22+K22)+1)))","v":0},0,0,0,0,0]
[null,null,null,null,null,null,"sièges attribués"]
[null,null,null,null,null,null,{"$f":"SUM(G13:G22)","v":25},null,null,null,null,null,null,null,null,{"$f":"SUM(P13:P22)","v":53}]
["VILLE DE CRETEIL\n\nELECTION MUNICIPALE\n1er tour - 9 MARS 2008"]
[]
[]
["COMPOSITION DU CONSEIL MUNICIPAL"]
[]
[]
[]
[]
["LISTES",null,"NOMBRE DE SIEGES"]
[]
[{"$f":"IF(B35>0,\"liste conduite par\",\"\")","v":"liste conduite par"},{"$f":"A13","v":"FRANCE INSOUMISE conduite par\nM. AUBRY"},{"$f":"P13","v":7},null,null,"A trier par ordre croissant sur colone nombre de sièges"]
["liste conduite par",{"$f":"A14","v":"FRANCE ROYALE conduite par \nR. de PREVOISIN"},{"$f":"P14","v":0}]
[{"$f":"IF(B37>0,\"liste conduite par\",\"\")","v":"liste conduite par"},"LIGNE CLAIRE conduite par\nR. CAMUS",0]
["liste conduite par","PARTI PIRATE conduite par \nF. MARIE",0]
["liste conduite par","RÉPUBLIQUE EN MARCHE conduite par \nN. LOISEAU",46]
[{"$f":"IF(B40>0,\"liste conduite par\",\"\")","v":"liste conduite par"},"DÉMOCRATIE RÉPRESENTATIVE conduite par \nH. TRAORE",0]
["liste conduite par","PATRIOTES ET GILETS JAUNES conduite par \nF. PHILIPPOT",0]
[{"$f":"IF(B42>0,\"liste conduite par\",\"\")","v":"liste conduite par"},"PACE conduite par \nA. ALEXANDRE",0]
["",0,0]
["",0,0]
[]
[]
[]
[]
[null,null,null,null,"Afficher de xgauche à xdroite pour graphique"]
[null,"Jean-Pierre FOURQUIN",0,null,null,null,1]
[null,"Jacky BRU",0,null,null,null,2]
[null,"Daniel GENDRE",0,null,null,null,3]
[null,"Laurent CATHALA",43,null,null,null,4]
[null,"Catherine DE LUCA",2,null,null,null,5]
[null,"Jérôme PITON",2,null,null,null,6]
[null,"Thierry HEBBRECHT",6,null,null,null,7]
[]
[]
[]
[null,null,{"$f":"SUM(C50:C59)","v":53}]
[]
[]
[]
[]
[]
[]
["VILLE DE CRETEIL\n\nELECTION MUNICIPALE\n1er tour - 9 MARS 2008"]
[]
["Calcul de la répartition des sièges"]
[]
["Listes conduites  par",{"$f":"A13","v":"FRANCE INSOUMISE conduite par\nM. AUBRY"},{"$f":"A14","v":"FRANCE ROYALE conduite par \nR. de PREVOISIN"},{"$f":"A15","v":"LIGNE CLAIRE conduite par\nR. CAMUS"},{"$f":"A16","v":"PARTI PIRATE conduite par \nF. MARIE"},{"$f":"A17","v":"RÉPUBLIQUE EN MARCHE conduite par \nN. LOISEAU"},{"$f":"A18","v":"DÉMOCRATIE RÉPRESENTATIVE conduite par \nH. TRAORE"},{"$f":"A19","v":"PATRIOTES ET GILETS JAUNES conduite par \nF. PHILIPPOT"},{"$f":"A20","v":"PACE conduite par \nA. ALEXANDRE"}]
["sièges attribués à la majorité",{"$f":"$F$13","v":0},{"$f":"$F$14","v":0},{"$f":"$F$15","v":0},{"$f":"$F$16","v":0},{"$f":"$F$17","v":27},{"$f":"$F$18","v":0},{"$f":"$F$19","v":0},{"$f":"$F$20","v":0}]
["sièges attribués à la proportionnelle",{"$f":"$G$13","v":7},{"$f":"$G$14","v":0},{"$f":"$G$15","v":0},{"$f":"$G$16","v":0},{"$f":"$G$17","v":18},{"$f":"$G$18","v":0},{"$f":"$G$19","v":0},{"$f":"$G$20","v":0}]
["sièges attribués à la proportionnelle à la plus forte moyenne",{"$f":"$I13+$K13+$M13+$O13","v":0},{"$f":"$I14+$K14+$M14+$O14","v":0},{"$f":"$I15+$K15+$M15+$O15","v":0},{"$f":"$I16+$K16+$M16+$O16","v":0},{"$f":"$I17+$K17+$M17+$O17","v":1},{"$f":"$I18+$K18+$M18+$O18","v":0},{"$f":"$I19+$K19+$M19+$O19","v":0},{"$f":"$I20+$K20+$M20+$O20","v":0}]
["TOTAL des sièges attribués à chaque liste",{"$f":"SUM(B72:B74)","v":7},0,0,0,46,0,0,0]